JPEXS Free Flash Decompiler Issue Tracker

If you are looking for the decompiler itself, visit https://github.com/jindrapetrik/jpexs-decompiler

NEW : We have got a new blog where we post some interesting SWF internals info.

Issue tracker

This is the place where all feature requests and bug reports of JPEXS Free Flash Decompiler (FFDec) are handled.

To submit new issue or issue editation, you should login first.

Filter
Help
Quick select: unfinished, everything, new bugs, new features, opened
Quick by label: ABC addFrameScript Adding script AIR Api versioning AS1/2 AS3 AVI BinaryData Blend modes Broken JPEG Broken SWF Build Bundles BUTTONCOND Buttons Canvas export Charset Clipping Commandline ConcurrentModification Cyclic tags Debugger Decompilation DefineInSprite Deobfuscation Direct Editation Documentation Embed Export External Viewer ExternalLink FFDec source ffdec.sh Filters Find usages FLA export Flash EOL Flash Viewer FlashCC Flex Fonts Formatting Frames Free transform GFX GIF Google Code GUI Harman HaXe Header Icon Iggy Images Import Import scripts ImportAssets Initializers Installation Java Java 9 JSyntaxPane Large SWF Letter spacing Library LineEndings Linux Loader LZMA Mac Memory search Miter join Monitor Morphshapes Multiple classes Namespaces Obfuscated on(xxx) P-code Packers PDF Performance Progress Proxy Raw Editation Read only SWF Rename identifiers RTL Scaling strokes Scenes Script execution Scrollbars Search Search Memory Shapes Simplify expressions Site feature Sound Special Sprites Stack size Startup SVG SWC SwfMovie SWFTools Tag position Tags Tamil Text Tools Translation Unicode Update system Value Too Large Video VirusTotal XML Zoom
Id▴TitleTypeStateHelpOwnerModified
#228 bug invalid user focus
#699 bug invalid user t.xiaoyaozi
#2044  export a large number of AS3 files(ISSUE) export a large number of AS3 files(ISSUE)bug new user succion
#1466  Problem when saving SWF file, all files are saved with extension .SWF.TMP Problem when saving SWF file, all files are saved with extension .SWF.TMPbug closed user BrunoMarin
#1355  Ribbon's menu does not fit into the screen (1280px) Ribbon's menu does not fit into the screen (1280px)bug closed user Nemo
#2060  The color selection screen cannot be displayed when the language setting is set to Japanese or Chinese. The color selection screen cannot be displayed when the language setting is set to Japanese or Chinese.bug new user Umonky
#1314  user interface user interfacebug closed user shared_login
#1006  Warning: Function value used where type Boolean was expected.  Possibly the parentheses () are missing after this function reference. Warning: Function value used where type Boolean was expected. Possibly the parentheses () are missing after this function reference.feature closed user BeniBela
#1405 "-selectclass" using the command line"-selectclass" using the command linequestion new user TCount
#1205 "-zoom" command line parameter for Frame export"-zoom" command line parameter for Frame exportfeature closed user alex
#27 "Cannot load SWF file" in the new 1.2.0 version"Cannot load SWF file" in the new 1.2.0 versionbug closed user googleCode
#494 "Check for updates" is not working with nighty build but is working with official release"Check for updates" is not working with nighty build but is working with official releasefeature closed user gamuti
#594 "Curly brace on new line" doesn't affect starting method brace"Curly brace on new line" doesn't affect starting method bracebug closed user focus
#1586 "DefineVideoStream [2]" stuck on desktop after closing program mid-export."DefineVideoStream [2]" stuck on desktop after closing program mid-export.question closed user VEVEEVEVEE
#431 "Deobfuscating" time"Deobfuscating" timebug closed user hojolo
#1877 "Dependent frames" field not updated after removing symbols"Dependent frames" field not updated after removing symbolsbug closed user STA20
#1665 "Export selection" button is grayed out for AS2 classes"Export selection" button is grayed out for AS2 classesbug closed user idk
#996 "Go to document class" does nothing when the document class name is obfuscated"Go to document class" does nothing when the document class name is obfuscatedbug closed user der
#1770 "Needed characters / Dependent characters" font unreadable in most themes"Needed characters / Dependent characters" font unreadable in most themesbug closed user STA20
#533 "ObjectUnderCursor" shows wrong tagnames"ObjectUnderCursor" shows wrong tagnamesbug closed developer honfika
#483 "printGraph max recursion level reached" exception"printGraph max recursion level reached" exceptionbug invalid user freddie
#268 "register" parameter names instead "_loc*_""register" parameter names instead "_loc*_"bug closed developer honfika
#1869 "Replace references with other character ID" not working on Images"Replace references with other character ID" not working on Imagesbug closed user STA20
#908 "Replacing" Image/Shape and then Saving SWF will corrupt SWF."Replacing" Image/Shape and then Saving SWF will corrupt SWF.bug closed user leeuniverse
#1008 "Short" type is decompiled incorrectly."Short" type is decompiled incorrectly.bug closed user Michael
#1976 "This Application requires Java Runtime Environment 1.8.0""This Application requires Java Runtime Environment 1.8.0"bug new user Nickelbath
#264 "true" statements (with automatic deobfuscation, too)"true" statements (with automatic deobfuscation, too)bug closed developer honfika
#1507 "§§" symbols mess everything up"§§" symbols mess everything upbug closed user Evgen
#222 #218 bug is not fixed yet (link not wrapped)#218 bug is not fixed yet (link not wrapped)bug closed user focus
#566 #566 weird bug with external flash player window in latest nightly after FFDec closing#566 weird bug with external flash player window in latest nightly after FFDec closingbug closed user megalol
#1185 #970 Imports of variables#970 Imports of variablesbug closed user BeniBela
#1186 #972 missing import#972 missing importbug closed user BeniBela
#2146 ' viewed as ' in some swf files.' viewed as ' in some swf files.bug upgraded user IntangibleMatter
#1938 ''this.'' placements in appropriate areas.''this.'' placements in appropriate areas.bug closed user pv_sol
#1095 '§§dup' appearing on simple function'§§dup' appearing on simple functionbug closed user ilufang
#1563 (2 issues) 1: White simple User Interface despite oceanic user interface skin | 2: definevideo and definevideostream(2 issues) 1: White simple User Interface despite oceanic user interface skin | 2: definevideo and definevideostreamquestion closed user BecauseitsAitme
#1986 (ActionScript2) "Not decompiled due to error" - message in decompilation(ActionScript2) "Not decompiled due to error" - message in decompilationbug closed user jd1337
#1685 (AS3) Exception when removing any entry from DefineSceneAndFrameLabelData (AS3) Exception when removing any entry from DefineSceneAndFrameLabelData bug closed user STA20
#906 -dumpAS3 commandline option not working-dumpAS3 commandline option not workingbug closed user jml
#883 -dumpSWF option does not work anymore-dumpSWF option does not work anymorebug closed user DaveZero
#1387 -enabledebugging -injectas3 supplied debug information results in incorrect line numbers during debugging-enabledebugging -injectas3 supplied debug information results in incorrect line numbers during debuggingquestion closed user muhbytes
#998 -format argument is not working in commandline-format argument is not working in commandlinebug closed user laforet
#1777 -importScript doesn't work as expected-importScript doesn't work as expectedbug new user yukkerike
#1483 -replace commandline arguments question-replace commandline arguments questionquestion closed user mojtaba
#1484 -replace commanline arg gives NullPointer on script problem-replace commanline arg gives NullPointer on script problembug closed user mojtaba
#1529 -selectid does not work on sprites and buttons-selectid does not work on sprites and buttonsbug closed user yoog290048
#1025 .swf.tmp.swf.tmpquestion closed user Midway
#1513 .swf.tmp problem.swf.tmp problembug closed user Pikarizard
#249 //Decompilation skipped//Decompilation skippedquestion closed user mepmep
#1097 /regexp/ compilation in AS3 direct editation/regexp/ compilation in AS3 direct editationbug closed user lyravega
#1342 /usr/bin/ffdec: line 30: [: too many arguments/usr/bin/ffdec: line 30: [: too many argumentsbug closed user JOELwindows7
#248 100% CPU usage on building script tree phase longer and longerr100% CPU usage on building script tree phase longer and longerrbug closed user focus
#1883 17.x.x is not showing all ActionScript files17.x.x is not showing all ActionScript filesquestion closed user capasha
#1968 18.3.4 not working18.3.4 not workingbug closed user AndrewAssassins
#652 2.1.4 startup script broken 2.1.4 startup script broken bug closed user physicist
#1440 3) PlayerGlobal (.swc) path  where do i find that??? ( 2. flash player projector content debugger path doesn't work)3) PlayerGlobal (.swc) path where do i find that??? ( 2. flash player projector content debugger path doesn't work)question closed user Nao
#1047 6.0.2 open all scripts folders6.0.2 open all scripts foldersbug closed user capasha
#1156 9-slice scaling support (DefineScalingGrid)9-slice scaling support (DefineScalingGrid)feature closed user Brandon
#1475 A bit meta: This bug tracker page's filter and sort aren't workingA bit meta: This bug tracker page's filter and sort aren't workingbug closed user DoomTay
#901 A lot of space after adding/replacing characters in fontsA lot of space after adding/replacing characters in fontsbug closed user Solomon
#2174 A problem when deleting framesA problem when deleting framesbug upgraded user STA20
#1443 A question regarding command line replacement for a scriptA question regarding command line replacement for a scriptquestion new user Madluv
#877 A small glitch after search in ASA small glitch after search in ASbug closed user megalol
#1501 A way to mass-import shapes, sprites, text, etc.A way to mass-import shapes, sprites, text, etc.feature closed user bobus
#2128 Ability for one to close an issue if they own itAbility for one to close an issue if they own itfeature new user syndiate
#1409 ability of adding actionscripts in a SWFability of adding actionscripts in a SWFfeature closed user GameHunter
#1410 ability of adding new tags in the SystemClass of a SWFability of adding new tags in the SystemClass of a SWFfeature closed user GameHunter
#1411 Ability to change images on spritesAbility to change images on spritesfeature closed user realmaster42
#928 Ability to edit linkage namesAbility to edit linkage namesfeature closed user Sandor
#1418 Ability to make jpex Always on topAbility to make jpex Always on topfeature new user RafatRifaie
#1121 Ability to save binary data by its nameAbility to save binary data by its namefeature closed user Brandon
#2132 ability to see soundstreamhead as separateability to see soundstreamhead as separatefeature upgraded user GreatFunk
#1790 about actionscript editingabout actionscript editingquestion opened user utopissed
#1312 about client.swf that release version can read it but nightly cant ..about client.swf that release version can read it but nightly cant ..bug closed user Djjom2x
#1527 access violationaccess violationbug postponed user 14362578
#2037 ActionScript Code cannot be saved.ActionScript Code cannot be saved.bug new user holyholymoly
#2131 ActionScript DebuggerActionScript Debuggerbug upgraded user Toonz
#2099 ActionScript decompiler altering numbers in the codeActionScript decompiler altering numbers in the codebug upgraded user 3plus4i
#2205 ActionScript Linkage to sound? (AS2)ActionScript Linkage to sound? (AS2)question opened user BDslick
#1567 Actionscript Refuses to SaveActionscript Refuses to Savequestion closed user BecauseitsAitme
#624 Actionscript search restrictionsActionscript search restrictionsfeature closed user redone
#1963 ActionScript source codeActionScript source codebug closed user deleted-TkolAyMRNBDiAfcSzYbD
#1311 actionScript source font sizeactionScript source font sizefeature closed user feipinxiang
#705 Actionscript-decompilation externalActionscript-decompilation externalfeature ignored user KurtWagner
#521 ActionScript2 decompilation problemActionScript2 decompilation problembug closed developer honfika
#2130 ActionScript2 Trace LogActionScript2 Trace Logquestion opened user Luxe3710
#424 ActionScriptParser.treeFromString generates unnecessary GetMember actionActionScriptParser.treeFromString generates unnecessary GetMember actionbug closed user l12436
#807 ActiveX and PlayerGlobal fail to download (during 4.1.0 install)ActiveX and PlayerGlobal fail to download (during 4.1.0 install)bug closed user PARQ
#925 Add a link to nightly build page to email notificationAdd a link to nightly build page to email notificationfeature closed developer honfika
#2179 Add a way to collapse an item treeAdd a way to collapse an item treefeature closed user RenderDragon
#1755 Add a way to copy and paste tagsAdd a way to copy and paste tagsfeature closed user CodeFizz
#708 Add ability to auto load binary data as subtree if it looks like there is SWF insideAdd ability to auto load binary data as subtree if it looks like there is SWF insidefeature closed user unv_annihilator
#1416 Add Action Scripts to SWFAdd Action Scripts to SWFfeature closed user RadiatedFox
#1992 Add assets to the SWFAdd assets to the SWFfeature closed user kolbdog32
#85 Add capapbility to find in all classes as textAdd capapbility to find in all classes as textfeature closed developer honfika
#220 Add changing fonts functionalityAdd changing fonts functionalityfeature closed user megalol
#396 add class membersadd class membersfeature closed user agos
#444 Add FFDec to SWF files context menu is not working under linux KDEAdd FFDec to SWF files context menu is not working under linux KDEfeature new user helmy
#1506 Add Flex SDK?Add Flex SDK?question closed user WindowsTV
#526 Add font to a swfAdd font to a swfquestion closed user arsay
#1707 Add frame to DefineSpriteAdd frame to DefineSpritequestion closed user BlasterGrim
#789 Add links to the issues to the profile pageAdd links to the issues to the profile pagefeature closed developer honfika
#492 Add new Hotkeys (all can post here what they want to add)Add new Hotkeys (all can post here what they want to add)feature closed user megalol
#1394 Add new script packAdd new script packquestion closed user TECHNIS
#1052 Add object to existing frameAdd object to existing framefeature closed user koen
#1044 Add Offset number to exported DoAction filenamesAdd Offset number to exported DoAction filenamesfeature closed user kurzedmetal
#824 Add OS X Application downloadAdd OS X Application downloadfeature returned user Tyilo
#2007 Add support for a specific deobfuscation typeAdd support for a specific deobfuscation typefeature opened user Gamedroit
#2090 Add support for automatic MochiCrypt decryptionAdd support for automatic MochiCrypt decryptionfeature closed user Aaron1011
#1820 Add support for decompiling standalone ABC filesAdd support for decompiling standalone ABC filesfeature closed user Aaron1011
#1307 Add support swf files with lzma compression.Add support swf files with lzma compression.feature closed user ra2fat
#2052 Adding a class to the first DoABC adds it to the second DoABC tag + Automatic Deobfuscation issueAdding a class to the first DoABC adds it to the second DoABC tag + Automatic Deobfuscation issuebug closed user Puzzlecube
#1435 Adding a DefineScalingGrid tag to a DefineSprite tag fails, and will corrupt the SWF when it is savedAdding a DefineScalingGrid tag to a DefineSprite tag fails, and will corrupt the SWF when it is savedbug closed user DavidJCobb
#1284 Adding a DefineShapeTag and then replacing it with an already existing SVG file or PNG file results in a still empty shape (with a few changes in the tag info)Adding a DefineShapeTag and then replacing it with an already existing SVG file or PNG file results in a still empty shape (with a few changes in the tag info)bug closed user tigeros
#2086 Adding AS3 class and extending it from another user created class breaks SWFAdding AS3 class and extending it from another user created class breaks SWFbug closed user Enrico
#2058 Adding classes in AS3 is only semi-functionalAdding classes in AS3 is only semi-functionalbug closed user Puzzlecube
#2102 Adding images via -importImages CLI is not workingAdding images via -importImages CLI is not workingquestion opened user rayyaw
#1598 Adding new scripts or folders in swfAdding new scripts or folders in swffeature closed user Kuroneko
#1662 Adding own custom search list per swfAdding own custom search list per swffeature new user Kuroneko
#1366 Adding scripts to swf fileAdding scripts to swf filefeature closed user MasterWex
#1806 Addition of CLI -replace option to update bounds for shapesAddition of CLI -replace option to update bounds for shapesfeature closed user Zavar
#2043 Adobe AIR SWF from iOS Game can't be loaded.Adobe AIR SWF from iOS Game can't be loaded.bug closed user HomeStarRunnerTron
#475 Advanded settings and language buttons are not centerAdvanded settings and language buttons are not centerfeature postponed user gamuti
#1830 after editing the action script i saved it, but when i try to exit the program says there are unsaved changesafter editing the action script i saved it, but when i try to exit the program says there are unsaved changesquestion opened user deu
#1969 After transform twice changings won't update in previewAfter transform twice changings won't update in previewquestion closed user Dragodraki
#1954 Again - Very high memory usage when previewing spritesAgain - Very high memory usage when previewing spritesbug closed user nosamu
#1268 Again problem with huge space between letters FONT replace/add/exportAgain problem with huge space between letters FONT replace/add/exportbug closed user michalss
#1822 AIR SDK supportAIR SDK supportfeature closed user cute_doge
#803 Align text (left, right, center) in Define*TextAlign text (left, right, center) in Define*Textfeature closed user megalol
#1138 All exported videos are the same file which may be brokenAll exported videos are the same file which may be brokenbug closed user DarkDaskin
#1743 Allow adding images tags: DefineSubImage & DefineExternalImage2Allow adding images tags: DefineSubImage & DefineExternalImage2feature closed user yotajac
#631 Allow renaming parameters and locals.Allow renaming parameters and locals.feature new user Mateon1
#143 Allow sorting in the issues tableAllow sorting in the issues tablefeature closed developer honfika
#1182 Allow to execute the source code from not a git repository folderAllow to execute the source code from not a git repository folderfeature closed developer honfika
#1007 Allow to replace binary data (ByteArrayRange) in raw editingAllow to replace binary data (ByteArrayRange) in raw editingfeature closed developer honfika
#758 Allow zooming to bigger than the preview areaAllow zooming to bigger than the preview areafeature closed developer honfika
#858 Allowto edit header propertiesAllowto edit header propertiesfeature closed developer honfika
#1578 Already complete chinese translationAlready complete chinese translationother closed user XiaozhiCar
#506 Alt-Tab - switching to another windowAlt-Tab - switching to another windowbug closed user FareakyTinkerton
#1591 Alt-Tab: main window constantly steals focusAlt-Tab: main window constantly steals focusbug closed user FareakyTinkerton
#1537 Alternate JREs not workingAlternate JREs not workingbug closed user PlayJoy
#1045 an error occured while starting the applicationan error occured while starting the applicationbug closed user hasnat
#1746 An error occured while starting the application.An error occured while starting the application.bug closed user Makcumka
#1750 An error occured while starting the application.An error occured while starting the application.bug closed user Grausamkeeit
#1354 An error occurred while attempting to convert swf to flv.An error occurred while attempting to convert swf to flv.bug closed user Daniel
#276 Anonymous functions are being instantiated with "new function()" instead of "function()"Anonymous functions are being instantiated with "new function()" instead of "function()"bug closed user soywiz
#405 Another Can't decompile a class / Obfuscated codeAnother Can't decompile a class / Obfuscated codebug closed user pkedpker
#983 Anti-aliasing in shape (+sprite) bitmap and html5 exportAnti-aliasing in shape (+sprite) bitmap and html5 exportfeature new developer honfika
#2106 Any way to change CXFORMWITHALPHA through ActionScript source code?Any way to change CXFORMWITHALPHA through ActionScript source code?question closed user Mokkor
#1381 App Wont Open, Please HelpApp Wont Open, Please Helpbug closed user Kimchi
#1555 App/.jar is not runningApp/.jar is not runningbug closed user radzo73
#834 Application crash when load swf file.Application crash when load swf file.bug closed user nhattuanbl
#2009 Application icon on macOS is brokenApplication icon on macOS is brokenbug closed user aculon
#1031 Application Won't Run if JAVA 64bit is installed (alongside with 32bit)Application Won't Run if JAVA 64bit is installed (alongside with 32bit)bug closed user SandBird
#514 applicationg hangs after a simple click on the flashname in treeviewapplicationg hangs after a simple click on the flashname in treeviewbug closed user capasha
#890 arabic arabic question closed user rachidlitim
#58 ArrayIndexOutOfBound exception (AS3)ArrayIndexOutOfBound exception (AS3)bug closed user pepka
#170 ArrayIndexOutOfBoundsExceptionArrayIndexOutOfBoundsExceptionbug closed user pepka
#421 ArrayIndexOutOfBoundsException and TimeoutExceptionArrayIndexOutOfBoundsException and TimeoutExceptionbug closed user mpuels
#1343 AS 1/2 direct editation critical bugAS 1/2 direct editation critical bugbug closed user megalol
#1091 AS 1/2 direct editation saving changes bugAS 1/2 direct editation saving changes bugbug closed user megalol
#39 AS 1/2 New MethodAS 1/2 New Methodbug closed user googleCode
#101 AS 1/2 while + increment/decrementAS 1/2 while + increment/decrementbug closed user pepka
#868 AS exporting bug (?)AS exporting bug (?)bug closed user megalol
#178 AS Subtract with negate problemAS Subtract with negate problembug closed user focus
#779 AS Variable name not being lostAS Variable name not being lostfeature new user realmaster42
#258 AS1/2 chained assignmentsAS1/2 chained assignmentsbug closed user focus
#172 AS1/2 checkPrecoNextParts() emptyness checks; not resolving constantsAS1/2 checkPrecoNextParts() emptyness checks; not resolving constantsbug closed user pepka
#51 AS1/2 decompilation defectAS1/2 decompilation defectbug closed user googleCode
#517 AS1/2 direct editation: delete operator, etc.AS1/2 direct editation: delete operator, etc.bug closed user deleted-FjT5MDkkfQCbTmonyvIp
#327 AS1/2 disassembly error (readActionList) stops whole applicationAS1/2 disassembly error (readActionList) stops whole applicationbug closed developer honfika
#817 AS1/2 for..in varible in expressionAS1/2 for..in varible in expressionbug closed user Kodak
#50 AS1/2 function body deobfuscation bugAS1/2 function body deobfuscation bugbug closed user googleCode
#40 AS1/2 No logging + For..in..return decompilationAS1/2 No logging + For..in..return decompilationbug closed user googleCode
#225 AS1/2 object literal does not permit quotes in namesAS1/2 object literal does not permit quotes in namesbug closed user focus
#94 AS2 ActionTry - register cast problemAS2 ActionTry - register cast problembug closed user pepka
#1005 AS2 code, first line with "§§push(false)"AS2 code, first line with "§§push(false)"bug closed user uragan1987
#135 AS2 Decompilation errorAS2 Decompilation errorbug closed user focus
#195 AS2 Decompilation errorAS2 Decompilation errorbug closed user focus
#957 AS2 decompilation error -  IndexOutOfBoundsExceptionAS2 decompilation error - IndexOutOfBoundsExceptionbug closed developer honfika
#739 AS2 decompilation failsAS2 decompilation failsbug closed developer honfika
#3 AS2 decompilation fails on these filesAS2 decompilation fails on these filesbug closed user googleCode
#141 AS2 Decompilation issueAS2 Decompilation issuebug closed user focus
#955 AS2 decompilation problem - IllegalArgumentExceptionAS2 decompilation problem - IllegalArgumentExceptionbug closed developer honfika
#1785 AS2 decompilation timeout for certain try/catch blocks within for...in loopsAS2 decompilation timeout for certain try/catch blocks within for...in loopsbug closed user idk
#186 AS2 Decompilation: show on-clip actions more user-friendlyAS2 Decompilation: show on-clip actions more user-friendlyfeature closed user focus
#223 AS2 Detecting uninitialized class fieldsAS2 Detecting uninitialized class fieldsbug closed user focus
#226 AS2 onClipAction indentation is absent in the Exported FLAAS2 onClipAction indentation is absent in the Exported FLAbug closed user focus
#95 AS2 while(true)AS2 while(true)bug closed user pepka
#150 AS3 decompilation "line too long" errorAS3 decompilation "line too long" errorbug closed user focus
#956 AS3 decompilation error - Invalid jumpAS3 decompilation error - Invalid jumpbug closed developer honfika
#959 AS3 decompilation error - StackOverflowErrorAS3 decompilation error - StackOverflowErrorbug closed developer honfika
#1030 AS3 decompilation error - StackOverflowErrorAS3 decompilation error - StackOverflowErrorbug closed developer honfika
#182 AS3 Decompilation issue - missing namespace importAS3 Decompilation issue - missing namespace importbug closed user focus
#149 AS3 decompilation issue: empty if branchesAS3 decompilation issue: empty if branchesbug closed user focus
#154 AS3 Decompilation Issues / Obfuscated codeAS3 Decompilation Issues / Obfuscated codebug invalid user focus
#1064 AS3 decompilation problemAS3 decompilation problembug closed developer honfika
#1126 AS3 decompiled with wrong setter and illegal break statementAS3 decompiled with wrong setter and illegal break statementbug closed user devbn
#1810 AS3 Decompiling problem + Source code of the file so you can see what to fixAS3 Decompiling problem + Source code of the file so you can see what to fixbug closed user Colly
#942 AS3 Deobfsucation - Stack owerflow exception in visitCodeAS3 Deobfsucation - Stack owerflow exception in visitCodebug closed developer honfika
#1033 AS3 deobfuscation removes useful codesAS3 deobfuscation removes useful codesbug closed developer honfika
#832 AS3 Direct Edit - Other ABCs resolvingAS3 Direct Edit - Other ABCs resolvingbug closed user realmaster42
#1271 AS3 Direct Edit breaks P-CodeAS3 Direct Edit breaks P-Codebug closed user realmaster42
#1074 AS3 Direct Edit Case-Switch not correctly togglingAS3 Direct Edit Case-Switch not correctly togglingbug closed user icepegasus
#1719 AS3 direct edit compound increment fails to saveAS3 direct edit compound increment fails to savebug closed user NicolasC
#1119 AS3 Direct Edit does not support the addition of eventsAS3 Direct Edit does not support the addition of eventsquestion closed user icepegasus
#1123 AS3 direct edit problem - 3rd argument of "for" statement stould support ","AS3 direct edit problem - 3rd argument of "for" statement stould support ","bug closed developer honfika
#896 AS3 direct edit: Method info deletion failsAS3 direct edit: Method info deletion failsbug closed user IceDarkness
#855 AS3 Direct editation - For in variable declarationAS3 Direct editation - For in variable declarationbug closed user Psychocrysma
#781 AS3 Direct editation bugAS3 Direct editation bugbug closed user pdmit
#725 AS3 direct editation fails with as3.swf test fileAS3 direct editation fails with as3.swf test filebug closed developer honfika
#1450 AS3 direct editation save ErrorAS3 direct editation save Errorbug closed user kevoting2
#759 AS3 direct editation: variable declaration is missingAS3 direct editation: variable declaration is missingbug closed user realmaster42
#775 AS3 Direction Edit Bug: Getter/Setter Traits don't auto update after savingAS3 Direction Edit Bug: Getter/Setter Traits don't auto update after savingbug closed user realmaster42
#791 AS3 edit problemAS3 edit problembug closed user pdmit
#1838 AS3 editor assumes that default value integers are signed even when the corresponding parameter is uintAS3 editor assumes that default value integers are signed even when the corresponding parameter is uintbug closed user pizzaeater1000
#347 AS3 for loop with return decompiled as while inversedAS3 for loop with return decompiled as while inversedquestion closed user pepka
#179 AS3 hasNext instead of foreach (wrong precontinue)AS3 hasNext instead of foreach (wrong precontinue)bug closed user focus
#642 AS3 imported classes outside SWF (?)AS3 imported classes outside SWF (?)bug postponed user marianux
#181 AS3 object field missing quotesAS3 object field missing quotesbug closed user focus
#256 AS3 Object literal in return clauseAS3 Object literal in return clausebug closed user focus
#1795 AS3 Options bugAS3 Options bugbug closed user Kuroneko
#669 AS3 P-code command-line replacement of static class variablesAS3 P-code command-line replacement of static class variablesquestion closed user loki
#1653 AS3 P-Code edit traits outside classesAS3 P-Code edit traits outside classesquestion closed user Kuroneko
#516 AS3 p-code: Editing namespaces with null names (index 0)AS3 p-code: Editing namespaces with null names (index 0)bug closed user capasha
#944 AS3 PCode reading problem (not deobfuscation)AS3 PCode reading problem (not deobfuscation)bug closed developer honfika
#593 AS3 Return object newline problemAS3 Return object newline problembug closed user focus
#964 as3 script decompiling is not deterministicas3 script decompiling is not deterministicbug closed developer honfika
#388 AS3 Script editorAS3 Script editorbug invalid user g200
#1104 AS3 Script Importation shown false "not supported" messageAS3 Script Importation shown false "not supported" messagebug closed user realmaster42
#850 AS3 static intializer wrong matching const multinamesAS3 static intializer wrong matching const multinamesbug closed user layola
#196 AS3 switch issue / automatic deobfuscationAS3 switch issue / automatic deobfuscationbug closed user pepka
#206 AS3 switch problemAS3 switch problembug closed user focus
#319 AS3: Finally statement exit handling (switch)AS3: Finally statement exit handling (switch)bug closed user freddie
#159 AS3: Improper rest parameter handling on MethodInfo tabAS3: Improper rest parameter handling on MethodInfo tabbug closed user djtrelos
#104 AS3: inc/dec loc NullpointerException, Multiple conditions in loopsAS3: inc/dec loc NullpointerException, Multiple conditions in loopsbug closed user pepka
#663 AS3: Missing imports from implemented interfacesAS3: Missing imports from implemented interfacesquestion closed user dexer
#1571 Ask for helpAsk for helpquestion closed user lb21
#536 Asset handling - modifying spritesAsset handling - modifying spritesquestion closed user James
#2092 Assigning Records (Vector points) of an SVG to a fillStyleAssigning Records (Vector points) of an SVG to a fillStylequestion new user FlamesEC
#987 assignment in for each lostassignment in for each lostbug closed user BeniBela
#974 Assignment in ifAssignment in ifbug closed user BeniBela
#1191 assignment missingassignment missingbug closed user BeniBela
#2020 Audio does not appearAudio does not appearbug new user cat1554
#1323 Audio playback failsAudio playback failsbug closed user henke37
#326 Automatic deobfuscasion malfunctionAutomatic deobfuscasion malfunctionbug closed user freddie
#211 Automatic deobfuscationAutomatic deobfuscationfeature closed user pepka
#232 Automatically add .swf to filenameAutomatically add .swf to filenamefeature closed user focus
#1199 Automatically import alpha channel do JPEG3 and JPEG4 tags from PNG.Automatically import alpha channel do JPEG3 and JPEG4 tags from PNG.feature closed user Jinxed_K
#1127 autoRenameIdentifiers is not supported in CLI modeautoRenameIdentifiers is not supported in CLI modebug closed user scheffield
#92 AVM greaterthan decompiles as "less than"AVM greaterthan decompiles as "less than"bug closed user offyoufly
#1034 AVM2DeobfuscatorRegisters is slowAVM2DeobfuscatorRegisters is slowfeature new developer honfika
#91 AVMgreaterthanAVMgreaterthanbug invalid user offyoufly
#512 Backslash before quote on commandline argumentsBackslash before quote on commandline argumentsquestion closed user megalol
#654 backslash-escaped file names on command line cause error in Linuxbackslash-escaped file names on command line cause error in Linuxbug closed user loki
#1570 Bad shape rendering in previewBad shape rendering in previewbug closed user rBVDGAAXqC6y7fL7byoG
#1448 Bad VirusTotal results - Hidden Malware?Bad VirusTotal results - Hidden Malware?other closed user AnApprenticeNot
#1232 Basic tag info improvementsBasic tag info improvementsfeature closed user megalol
#1698 Batch Export not workingBatch Export not workingbug closed user ShikuTeshi
#1352 Better font importingBetter font importingfeature new user JoeH
#1913 Better way to raw edit Shapes and its propertiesBetter way to raw edit Shapes and its propertiesfeature new user Toxic
#612 bgcolor and width & heightbgcolor and width & heightfeature closed user ipb
#2089 big integer in actionscriptbig integer in actionscriptquestion opened user NEMAMENE
#160 binaryData export from commandlinebinaryData export from commandlinebug closed user liandry
#1562 Black squares pop up everywhere on images and frames Black squares pop up everywhere on images and frames question closed user BecauseitsAitme
#1112 Blur when I replace a "DefineShape" with a PNG imageBlur when I replace a "DefineShape" with a PNG imagefeature closed user Orsos
#873 Brainstorming about tag tree context menuBrainstorming about tag tree context menufeature closed developer honfika
#2048 broken .flabroken .flabug upgraded user wox
#1139 Broken link for install_flash_player_ax.exeBroken link for install_flash_player_ax.exebug closed user maijin
#218 Bug in bugtracker: long links are not fill in text areaBug in bugtracker: long links are not fill in text areabug closed user focus
#1672 bug when entering any value over 4 digitsbug when entering any value over 4 digitsbug closed user STA20
#1614 Bug with "Find usage"Bug with "Find usage"bug new user Kuroneko
#1239 Bug with font preview, after glyph insertBug with font preview, after glyph insertbug closed user strelokhalfer
#892 bug with nightlys update checkbug with nightlys update checkbug closed user megalol
#1640 Bug with search results windowBug with search results windowbug closed user Kuroneko
#1980 Bug with sprite animationBug with sprite animationbug postponed user AzazelGames
#1600 Bug with switching keyboard languageBug with switching keyboard languagebug closed user Kuroneko
#328 bugged behavior after replacing DefineBitsJPEGX imagesbugged behavior after replacing DefineBitsJPEGX imagesbug closed user megalol
#1943 Bulk operations (delete)Bulk operations (delete)feature new user Jouki
#1749 Button for inherit classesButton for inherit classesquestion closed user Kuroneko
#1177 Button parameters within JPEXS output?Button parameters within JPEXS output?question closed user joneleit
#1179 Button sound doesn't appear in the exported fla fileButton sound doesn't appear in the exported fla filebug closed user c200210018
#1301 Cache files are still opened by java even after clearCache files are still opened by java even after clearbug closed user zorzo
#9 Caching for code positions while decompilingCaching for code positions while decompilingfeature closed user googleCode
#33 calling constructor in static const initializercalling constructor in static const initializerbug closed user googleCode
#1302 callpropvoid instruction docblock not correctcallpropvoid instruction docblock not correctbug closed user afraca
#2186 CallPropVoid Multiname.CallPropVoid Multiname.question closed user SamHoque
#1166 Can a DefineText character string be converted into a link (URL)?Can a DefineText character string be converted into a link (URL)?question closed user joneleit
#487 Can I save a compressed file with decompressed data?Can I save a compressed file with decompressed data?question closed user poxyran
#548 Can JPEXS show fully dis-assembled class files like rabcdasm does? Can JPEXS show fully dis-assembled class files like rabcdasm does? question closed user pmolson
#1160 Can not save after edit (experimental) - SEVERECan not save after edit (experimental) - SEVEREbug closed user bhfff
#1148 Can this file be decompiled? I'm getting no luckCan this file be decompiled? I'm getting no luckbug closed user shyden
#1473 Can you even replace SoundStreamHeads?Can you even replace SoundStreamHeads?feature closed user BlueWonder
#666 Can'Can'other invalid user jennagirl85
#1573 can't add class!!!can't add class!!!question closed user jackma
#1742 Can't add more frames to a spriteCan't add more frames to a spritequestion closed user RatMann
#2108 Can't change textCan't change textbug upgraded user Pipis
#116 Can't decompile a class / Obfuscated codeCan't decompile a class / Obfuscated codebug closed user focus
#402 Can't decompile Flash Antidecompiler 6.9 obfuscated codeCan't decompile Flash Antidecompiler 6.9 obfuscated codebug closed user focus
#84 Can't decompile some classesCan't decompile some classesbug closed developer honfika
#742 Can't edit framesCan't edit framesbug closed user Zizi17
#1439 can't edit the first line of actionscriptcan't edit the first line of actionscriptbug ignored user noname
#1673 Can't extract all scripts after version 14.1.0Can't extract all scripts after version 14.1.0bug closed user auroraegold
#1403 Can't import an exported pcodes using the -importScript commandCan't import an exported pcodes using the -importScript commandbug new user kenma9123
#1997 Can't import Symbol-ClassCan't import Symbol-Classbug closed user Penteste27
#856 Can't load any SWFsCan't load any SWFsbug closed user capasha
#1442 Can't load Iggy file.Can't load Iggy file.bug opened user masumi
#639 Can't open anything except imagesCan't open anything except imagesbug closed user Masocrate
#2054 Can't preview using flash playerCan't preview using flash playerquestion closed user Thisguy248
#849 Can't recompile (experimental function)Can't recompile (experimental function)bug closed user Psychocrysma
#1771 Can't render parts of shapesCan't render parts of shapesbug closed user STA20
#988 Can't Save as exeCan't Save as exebug closed user capasha
#1589 Can't save filesCan't save filesbug closed user akira_temp
#1669 Can't save the file after removing a bitmap that is part of a shapeCan't save the file after removing a bitmap that is part of a shapebug closed user STA20
#918 Can't start FFDecCan't start FFDecbug postponed user capasha
#241 Can't start the program.Can't start the program.bug closed user megalol
#1523 Can't type while editing frame dataCan't type while editing frame databug closed user BDslick
#1452 Can't Use (missing java?)Can't Use (missing java?)question closed user BrokenNotDaily
#1327 Can't use uppercase codeCan't use uppercase codebug closed user capasha
#191 Can't view DefineShape4 Tag using Internal viewerCan't view DefineShape4 Tag using Internal viewerbug closed user focus
#886 Cancel button is disabled in editor mode. I'd like to reset the change.Cancel button is disabled in editor mode. I'd like to reset the change.bug closed admin JPEXS
#951 Cancel script search is not workingCancel script search is not workingbug closed admin JPEXS
#419 Cand open(decompile)SWF fileCand open(decompile)SWF filequestion invalid user solodarkban
#1376 Cannot access resources in some SWFCannot access resources in some SWFquestion closed user Zamasu
#729 Cannot decompile obfuscated 'scripts\com\adobe\utils\DateUtil.as'Cannot decompile obfuscated 'scripts\com\adobe\utils\DateUtil.as'bug invalid user 1nd1g0
#765 Cannot download ( for windows)Cannot download ( for windows)other closed user goel.suraj5
#272 Cannot edit class initializer / constantsCannot edit class initializer / constantsbug closed user capasha
#813 Cannot edit public static constCannot edit public static constquestion closed user negus
#1175 Cannot edit/set/copy ActionScript name of symboldCannot edit/set/copy ActionScript name of symboldbug closed user JhonSilver
#664 Cannot expand fillStyles in DefineShape tags in raw editCannot expand fillStyles in DefineShape tags in raw editbug closed user Varq
#2184 Cannot Export FLA when placeFlagMove is trueCannot Export FLA when placeFlagMove is truebug closed user Luxe3710
#2170 Cannot find class within same packageCannot find class within same packagebug new user ReactX
#1736 Cannot load some *.iggy filesCannot load some *.iggy filesbug postponed user mix
#1582 Cannot load swfCannot load swfbug ignored user AidentheTechBoy
#2083 Cannot output text with specified Vietnamese characters/lettersCannot output text with specified Vietnamese characters/lettersquestion closed user Intelparcel11
#1678 Cannot preview some elementsCannot preview some elementsbug closed user STA20
#1348 Cannot properly export frame with cyrillic symbols to SVGCannot properly export frame with cyrillic symbols to SVGbug closed user dikelito
#635 Cannot properly place text cursor with Japanese charactersCannot properly place text cursor with Japanese charactersbug closed user Varq
#1915 Cannot read field "ratio" because "value" is nullCannot read field "ratio" because "value" is nullbug closed user _90_
#994 Cannot replace alpha channelCannot replace alpha channelbug closed user laforet
#1971 Cannot run FFdec 18.3.4: An error occurred while starting the application."Cannot run FFdec 18.3.4: An error occurred while starting the application."bug closed user nosamu
#2014 Cannot save .as3 file Cannot save .as3 file bug closed user LifeHaxGamer_
#1461 Cannot save actionscript code. SEVERE error in logCannot save actionscript code. SEVERE error in logbug closed user MasterWex
#1741 Cannot save AS1/2 new String(xx) callCannot save AS1/2 new String(xx) callbug closed user sombraguerrero
#2016 Cannot save AS3 after editationCannot save AS3 after editationbug closed user RenderDragon
#406 cannot save filecannot save filebug closed user ise7845
#581 Cannot save fileCannot save filebug closed user PeroO
#632 Cannot save fileCannot save filebug closed user myztikrice
#634 Cannot save fileCannot save filebug closed user Kirbyofdeath
#410 Cannot save the edited codeCannot save the edited codebug closed user yhaki
#499 Cannot save via ProxyCannot save via Proxybug closed user mybottt
#1977 Cannot see usages of class or functionCannot see usages of class or functionbug closed user RenderDragon
#953 Cannot start FFDec.appCannot start FFDec.appbug returned user goberlin
#384 Cannot stop sound playingCannot stop sound playingbug closed user capasha
#1176 Cant add characterId to placeobjectCant add characterId to placeobjectbug closed user JhonSilver
#577 cant copy and paste when edit p-codecant copy and paste when edit p-codebug closed user medz
#694 Cant decompile SeafightMain.swfCant decompile SeafightMain.swffeature closed user sinlyu
#1423 Cant edit some action scripts in this swfCant edit some action scripts in this swfbug closed user RadiatedFox
#1500 Cant find file swf version >37 in memoryCant find file swf version >37 in memoryquestion closed user kai
#1688 cant import freshly exported (or any) scriptcant import freshly exported (or any) scriptquestion closed user oldgrounds
#667 Cant open fileCant open fileother invalid user jennagirl85
#1404 CANT OPEN FILECANT OPEN FILEbug invalid user dodge
#1015 cant save swf filecant save swf filebug closed user malik123
#882 Canvas export border sizeCanvas export border sizebug closed developer honfika
#620 Canvas export interractivity improvementCanvas export interractivity improvementfeature postponed user psykauze
#1002 CASE / IF EILSE substitution on decomilation CASE / IF EILSE substitution on decomilation bug closed user RoverWhite
#885 Categories in issue trackerCategories in issue trackerfeature closed developer honfika
#292 Change background color in SWF previewChange background color in SWF previewfeature closed user megalol
#2055 Change depth in multiple frames?Change depth in multiple frames?question new user TeKett
#1751 change font letter sizechange font letter sizeother new user swfhacker
#1422 change shapechange shapequestion closed user ZeroX4
#1120 Change shape sizeChange shape sizequestion closed user peroncho
#1141 Change shape sizeChange shape sizequestion closed user RASMiranda
#703 Changes do not get savedChanges do not get savedbug invalid user mentalist
#1547 Changing image positionChanging image positionquestion closed user Chinomso
#474 Changing language only available one timeChanging language only available one timebug closed user gamuti
#321 Changing size of  FFDec window and drop a file ends in crashChanging size of FFDec window and drop a file ends in crashbug closed user capasha
#1213 Changing tag typesChanging tag typesquestion closed user Nanasaki_Koko
#1229 Changing the script via P-Code/HEX not work correctlyChanging the script via P-Code/HEX not work correctlybug ignored user GAMELASTER
#777 Check for Nighty build update is no workingCheck for Nighty build update is no workingbug closed user gamuti
#1611 Checkbox to not show notification againCheckbox to not show notification againfeature closed user Kuroneko
#498 Chinese language translationChinese language translationbug invalid user rendu2mai
#1701 Chinese text don't show correctlyChinese text don't show correctlybug closed user XiaozhiCar
#1269 Chinese Translation error: Frame(s)Chinese Translation error: Frame(s)other closed user aprikyblue
#125 Class fields position in the decompilation listingClass fields position in the decompilation listingfeature closed user focus
#978 Class names are case sensitive, but filenames are not, so they are overwritten sometimes during exportClass names are case sensitive, but filenames are not, so they are overwritten sometimes during exportbug closed developer honfika
#340 Class too large to decompile.Class too large to decompile.question closed user layola
#2017 Classes in same package displayed as FQN, why?Classes in same package displayed as FQN, why?bug closed user smartcube
#455 Classic interface issuesClassic interface issuesbug closed user helmy
#457 Clear all recent opened filesClear all recent opened filesfeature closed user capasha
#301 Clear errors logClear errors logfeature closed user focus
#1243 clicking edit in P-code source 1st time makes it jump to line 1 thereclicking edit in P-code source 1st time makes it jump to line 1 therebug closed user Owyn
#1163 Clicking on Open > File will make the program buggyClicking on Open > File will make the program buggybug postponed user capasha
#1990 Cloning/pasting Sprites not workingCloning/pasting Sprites not workingbug closed user Flamming
#1616 Close and search buttonsClose and search buttonsfeature closed user Kuroneko
#1962 Close button can close more than one file at once.Close button can close more than one file at once.bug new user STA20
#1882 Close button not workingClose button not workingbug closed user STA20
#1897 Close button not working, part 2Close button not working, part 2bug closed user STA20
#895 CMYK JPEG image decoded wronglyCMYK JPEG image decoded wronglybug closed developer honfika
#962 Code formatting issueCode formatting issuebug closed developer honfika
#2013 Code panel vanishing after global identifier renamingCode panel vanishing after global identifier renamingbug closed user RenderDragon
#2003 COLON expected but DOT foundCOLON expected but DOT foundbug closed user Mostafa
#1733 Combat Tournament Sprite 1808 Frame 1 first DoAction script breaks when editedCombat Tournament Sprite 1808 Frame 1 first DoAction script breaks when editedbug opened user CombatTournamentGod
#302 Comfortable code navigationComfortable code navigationfeature new user focus
#1365 Command -importScript should be able to pass Flex SDK path as another optional command line argumentCommand -importScript should be able to pass Flex SDK path as another optional command line argumentfeature closed user buckybacon
#438 Command line arguments renameInvalidIdentifiers and dumpSWF don't work anymoreCommand line arguments renameInvalidIdentifiers and dumpSWF don't work anymorebug closed user cattode
#1363 Command line delete image with dependenciesCommand line delete image with dependenciesquestion opened user rdlsz24
#313 command line parameter for ignore all errorscommand line parameter for ignore all errorsfeature closed developer honfika
#269 command line parameters for switching on/off deobfuscation and paralellspeedupcommand line parameters for switching on/off deobfuscation and paralellspeedupfeature closed developer honfika
#1071 Commandline doesn't workCommandline doesn't workbug closed user capasha
#8 Commandline ExportCommandline Exportfeature closed user googleCode
#1528 Commanline -zoom option not workingCommanline -zoom option not workingbug closed user JPEXSuser
#1604 Comments in p-codeComments in p-codequestion closed user Kuroneko
#1214 Comparitors are Reversed!Comparitors are Reversed!other closed user C3Pex
#1493 Compile CastOp not being used problemCompile CastOp not being used problembug closed user Owyn
#655 Compile errorCompile errorquestion closed user coody
#1494 Compile GetURL2 not being used problemCompile GetURL2 not being used problembug closed user Owyn
#1134 Compile preprocessor §§instructions while direct edit.Compile preprocessor §§instructions while direct edit.feature new admin JPEXS
#2114 compiler ignores parenthesis important for order of executioncompiler ignores parenthesis important for order of executionquestion opened user 3plus4i
#1498 compiler, modify decompilercompiler, modify decompilerfeature closed user Bestie
#637 Compiling source codeCompiling source codequestion closed user myztikrice
#717 Completely replace swf caught by ProxyCompletely replace swf caught by Proxyfeature closed user focus
#1924 Composite sprite seems to loop subsprites of shorter lengthComposite sprite seems to loop subsprites of shorter lengthbug postponed user pim
#1804 Compressed scaleform GFx files don't decompileCompressed scaleform GFx files don't decompilequestion closed user konrad
#1991 ConcurrentModificationException on cache threadConcurrentModificationException on cache threadbug closed user STA20
#1865 ConcurrentModificationException on SWF closeConcurrentModificationException on SWF closebug closed user STA20
#350 Configuration setting for opening new swfs in the existing FFDec instance.Configuration setting for opening new swfs in the existing FFDec instance.feature closed user poxyran
#2027 ConfusionConfusionbug opened user Moonimochi
#2157 Connecting to a local server.Connecting to a local server.question new user Piping
#1145 consecutive NOT(!)s are being merged, altering the code behavior at timesconsecutive NOT(!)s are being merged, altering the code behavior at timesbug closed user ilufang
#960 Consider changeing the decompile method timeout to a lower valueConsider changeing the decompile method timeout to a lower valuefeature new developer honfika
#1497 Constant pool strings not being reused when editing swfConstant pool strings not being reused when editing swfbug closed user wolf_haley
#1037 ConstructIns: xmlMult.isXML called 2 times with the same parameter. Why?ConstructIns: xmlMult.isXML called 2 times with the same parameter. Why?question closed developer honfika
#2178 Content is not visually updated after using UndoContent is not visually updated after using Undobug upgraded user STA20
#1682 Context menu Add script on various items in AS1/2Context menu Add script on various items in AS1/2feature opened admin JPEXS
#123 Context menu integrationContext menu integrationfeature closed user focus
#583 Conversion of FlashPaper SWF to PDF and/or ODT (libreoffice) documenrConversion of FlashPaper SWF to PDF and/or ODT (libreoffice) documenrfeature closed user Fonzy
#1711 Convert attached swf to pdf. There is font issue. And sometimes may even not display any text. Convert attached swf to pdf. There is font issue. And sometimes may even not display any text. bug closed user nissanjp
#1270 convert_i: adding extra cast with each saveconvert_i: adding extra cast with each savebug closed user koen
#2100 Copy paste frame Copy paste frame feature upgraded user modder69
#745 Copy tag toCopy tag tofeature closed user focus
#1910 Copy Transform Settings Copy Transform Settings feature returned user modder69
#716 Copy url of the swf caught by ProxyCopy url of the swf caught by Proxyfeature closed user focus
#2193 Copy-pasting Frames between different SWFsCopy-pasting Frames between different SWFsfeature new user tamingsoul
#2125 Copy/paste tags between different SWFsCopy/paste tags between different SWFsfeature closed user syndiate
#1647 Copying to Clipboard no longer supports transparencyCopying to Clipboard no longer supports transparencybug closed user radzo73
#1392 Corrupted compiled script after modifying or just saving.Corrupted compiled script after modifying or just saving.bug closed user jeff
#338 Cosmetic: Errors log expand (+) icon doesn't switch back after expand->collapse (remains "-")Cosmetic: Errors log expand (+) icon doesn't switch back after expand->collapse (remains "-")bug closed user focus
#294 Cosmetic: labels are shifted in font parameters a bitCosmetic: labels are shifted in font parameters a bitbug closed user focus
#279 Could not view AS hide in BinaryDataCould not view AS hide in BinaryDataquestion closed user hungpq
#52 CP with a wrong action lengthCP with a wrong action lengthbug closed user googleCode
#917 CPU Spikes to 100% on This FileCPU Spikes to 100% on This Filebug closed user CraigP
#574 Crash after editing scriptsCrash after editing scriptsbug invalid user realmaster42
#1316 Create font picker dialog and use it in settings dialogCreate font picker dialog and use it in settings dialogfeature new developer honfika
#382 Create new functionsCreate new functionsfeature closed user null
#1681 Creating packages after clicking on a subfolderCreating packages after clicking on a subfolderfeature closed user BiosNod
#554 Critical bug - saving of edited AS has no effect since 2.0.0_6ab392f5ff25Critical bug - saving of edited AS has no effect since 2.0.0_6ab392f5ff25bug closed user megalol
#1511 CTRL + F search images and soundsCTRL + F search images and soundsfeature closed user kevoting2
#1259 CTRL Click on AS3 Functions do not work anymore + question.CTRL Click on AS3 Functions do not work anymore + question.bug closed user WindowsTV
#2190 CURLY_CLOSE expected but COLON found on line 700CURLY_CLOSE expected but COLON found on line 700bug new user umbra
#1328 CURLY_CLOSE expected but IDENTIFIER found in as3.swf test fileCURLY_CLOSE expected but IDENTIFIER found in as3.swf test filebug closed developer honfika
#1304 CURLY_CLOSE expected but IF found on line 145CURLY_CLOSE expected but IF found on line 145question closed user mockingbird
#1652 Cursor bug in search windowCursor bug in search windowbug new user Kuroneko
#2000 Cursor is never placed where the mouse actually isCursor is never placed where the mouse actually isbug upgraded user OBR
#2049 Cut to tag clipboard issueCut to tag clipboard issuebug new user noobsaibot
#1530 CWS to FWSCWS to FWSquestion closed user yoog290048
#1824 CXT File With Models InsideCXT File With Models Insidequestion opened user BobJow
#401 DComSoft  SWF Protector 4: Error during tag readingDComSoft SWF Protector 4: Error during tag readingbug closed user focus
#1274 Deb package requires specifically Oracle's JREDeb package requires specifically Oracle's JREbug closed user Caagr98
#707 Debug HookDebug Hookfeature closed user cenadacoisa
#1395 Debug not workingDebug not workingbug closed user castacio
#1209 Debug SWF running in browserDebug SWF running in browserfeature new user focus
#740 debugConsole call fails when multiple parameter is passed to this functiondebugConsole call fails when multiple parameter is passed to this functionbug closed developer honfika
#1356 Debugger internet accessDebugger internet accessquestion closed user mrSWF
#1383 Debugging nested SWFsDebugging nested SWFsfeature new user muhbytes
#2065 Debugging Question/IssueDebugging Question/Issuequestion opened user LeafyLemon124
#1850 Debugging SWF from browserDebugging SWF from browserquestion new user zzVertigo
#1254 Decoding AS3 timeline scripsDecoding AS3 timeline scripsfeature closed user turkeybaster5723
#1686 Decompilation and direct editation of nested tellTargetDecompilation and direct editation of nested tellTargetbug closed user Badfitz66
#2126 Decompilation errorDecompilation errorquestion opened user 1123
#941 Decompilation error - IndexOutOfBoundsExceptionDecompilation error - IndexOutOfBoundsExceptionbug closed developer honfika
#954 Decompilation error - IndexOutOfBoundsExceptionDecompilation error - IndexOutOfBoundsExceptionbug closed developer honfika
#946 Decompilation error - Invalid jumpDecompilation error - Invalid jumpbug closed developer honfika
#535 Decompilation error Code may be obfuscatedDecompilation error Code may be obfuscatedbug closed user acid0
#372 Decompilation error Timeout (1 minute) was reachedDecompilation error Timeout (1 minute) was reachedother closed user zap
#420 Decompilation error, EmptyStackExceptionDecompilation error, EmptyStackExceptionbug closed user freddie
#370 Decompilation error,for this swf ,has many erros,Decompilation error,for this swf ,has many erros,bug closed user xuanhun
#213 decompilation errorsdecompilation errorsbug closed developer honfika
#376 Decompilation errorsDecompilation errorsbug closed user megalol
#735 Decompilation errorsDecompilation errorsbug closed user bls1999
#830 Decompilation errors with certain nested if-then-else and logical operatorsDecompilation errors with certain nested if-then-else and logical operatorsbug closed user JackB
#1279 Decompilation of traits (methods, fields) with same nameDecompilation of traits (methods, fields) with same namefeature closed admin JPEXS
#755 Decompilation TimeOut FeatureDecompilation TimeOut Featurefeature closed user realmaster42
#963 Decompilation timeoutsDecompilation timeoutsbug opened developer honfika
#244 decompilaton errorsdecompilaton errorsbug closed developer honfika
#281 Decompile .swf protected with secureSWFDecompile .swf protected with secureSWFfeature closed user megalol
#1814 Decompile a .as file from .swf command lineDecompile a .as file from .swf command linequestion opened user readix
#1050 Decompile ActionScript in "Export SWF XML"Decompile ActionScript in "Export SWF XML"feature closed user Pneumaticat
#812 decompile faildecompile failbug closed user uragan1987
#48 Decompile only specified classDecompile only specified classfeature closed user googleCode
#1809 Decompile SWF to open project in FlashDevelopDecompile SWF to open project in FlashDevelopquestion new user cypolo
#1248 Decompile the code using FlashCC will lead to incorrect result.Decompile the code using FlashCC will lead to incorrect result.bug postponed user aprikyblue
#1277 Decompile&Edit bug - JPEXS v9.0.0Decompile&Edit bug - JPEXS v9.0.0bug closed user ultra_xerox
#1161 decompile/deoobfus file faileddecompile/deoobfus file failedbug closed user uragan1987
#395 Decompile/Edit GFx fontsDecompile/Edit GFx fontsfeature closed user michalss
#792 Decompiled code cannot be ran because of RegExp.Decompiled code cannot be ran because of RegExp.bug closed user zhengdk
#1474 Decompiled output is somewhat confusingDecompiled output is somewhat confusingbug closed user DoomTay
#1495 decompilerdecompilerbug closed user Bestie
#1866 Decompiler corrupts SWF when exporting to FLADecompiler corrupts SWF when exporting to FLAbug upgraded user djmrFunnyMan
#47 Decompiler do not produce AS script anymoreDecompiler do not produce AS script anymorebug closed user googleCode
#786 Decompiler errorsDecompiler errorsbug closed user kurzedmetal
#1813 Decompiler freezes instantly because windows 10 probablyDecompiler freezes instantly because windows 10 probablybug new user pizzaeater1000
#16 Decompiler hangs when a AS3 SWF contains a call to a method that does not existDecompiler hangs when a AS3 SWF contains a call to a method that does not existbug ignored user googleCode
#1712 Decompiler is failing to handle an image, which shows up on the Adobe Flash projector.Decompiler is failing to handle an image, which shows up on the Adobe Flash projector.bug closed user shivam
#947 Decompiletion timeouts (not cmodule)Decompiletion timeouts (not cmodule)bug closed developer honfika
#1358 Decompiling errorsDecompiling errorsbug invalid user Daniel
#1364 Decompiling errorsDecompiling errorsbug closed user Daniel
#1375 Decompiling failsDecompiling failsbug invalid user froheweihnachten
#277 Decompiling FlasCC SWFsDecompiling FlasCC SWFsfeature postponed user paleozogt
#1772 Decompiling Timeout / Stack OverflowDecompiling Timeout / Stack Overflowbug closed user Shuckle
#242 decompiltion error: EmptyStackExceptiondecompiltion error: EmptyStackExceptionbug closed developer honfika
#266 decompiltion error: EmptyStackExceptiondecompiltion error: EmptyStackExceptionbug closed developer honfika
#66 Decompress LZMA from commandlineDecompress LZMA from commandlinefeature closed admin JPEXS
#1619 Decrease process priorityDecrease process priorityfeature new user phantasm
#290 Default language selection dialog width is too smallDefault language selection dialog width is too smallbug closed user focus
#480 Define*texts export doesn't works in latest nightlyDefine*texts export doesn't works in latest nightlybug closed user megalol
#881 Define*Texts parameters panel disappearing (in some cases) bugDefine*Texts parameters panel disappearing (in some cases) bugbug closed user megalol
#68 DefineBinaryData & SymbolClassDefineBinaryData & SymbolClassfeature closed admin JPEXS
#1922 DefineBitsJPEG3 tags exported as JPEG with .png extension in FLA/XFLDefineBitsJPEG3 tags exported as JPEG with .png extension in FLA/XFLbug closed user nosamu
#1748 DefineEditText renders wrong fontsDefineEditText renders wrong fontsbug closed user Akira896
#2203 DefineExternalImage2 TGA textures cause a memory leakDefineExternalImage2 TGA textures cause a memory leakbug upgraded user Notex
#469 DefineFont* parameters buttons problem since 8857665003a9 nightlyDefineFont* parameters buttons problem since 8857665003a9 nightlybug closed user megalol
#198 DefineFont2TagDefineFont2Tagbug closed user pepka
#1548 DefineFont3 tag cannot be dumpedDefineFont3 tag cannot be dumpedbug closed user nissansz
#1747 DefineShapeDefineShapequestion closed user Phongpon
#1533 DefineSprite to Transparent PNGDefineSprite to Transparent PNGbug closed user Prozacs
#671 DefineSprite.PlaceObject linebreakDefineSprite.PlaceObject linebreakquestion closed user TomVerkerk
#567 DefineText editing is not working with DefineFontDefineText editing is not working with DefineFontbug closed user francesco
#1564 DefineVideoStream IssueDefineVideoStream Issuebug closed user BecauseitsAitme
#1827 DefineVideoStream(.flv) replace/import in command lineDefineVideoStream(.flv) replace/import in command linefeature closed user megalol
#1905 DEL key not working on thumbnailsDEL key not working on thumbnailsbug closed user STA20
#1602 Delete traits buttonDelete traits buttonfeature closed user Kuroneko
#1639 Deleting recents search results in swfDeleting recents search results in swffeature closed user Kuroneko
#1056 deltaY missing when adding a new StraightEdgeRecorddeltaY missing when adding a new StraightEdgeRecordbug closed user koen
#417 Deobfuscate: Exporting Fla ErrorDeobfuscate: Exporting Fla Errorbug closed user jenyene
#590 Deobfuscation error : get what it was able to readDeobfuscation error : get what it was able to readquestion closed user moonlightangel
#265 deobfuscation problemdeobfuscation problembug closed developer honfika
#352 Deobfuscation rollbackDeobfuscation rollbackfeature closed user usroboticz
#368 Deobfuscation: AS2 Decompilation issuesDeobfuscation: AS2 Decompilation issuesbug closed user focus
#473 Deobfuscation: doesn't works with lot of swf filesDeobfuscation: doesn't works with lot of swf filesbug closed user gamuti
#1157 Deobfuscation: evaluate arithmetic constantsDeobfuscation: evaluate arithmetic constantsfeature closed user thiht
#403 Deobfuscation: SWF Encrypt 7.0: SEVERE nullDeobfuscation: SWF Encrypt 7.0: SEVERE nullbug closed user focus
#339 Deobsufcation: FailsDeobsufcation: Failsbug closed user macgeek
#317 Detailed log filesDetailed log filesfeature closed user end0re
#1202 Detect file change and ask the user to reloadDetect file change and ask the user to reloadfeature closed developer honfika
#1197 Detect obfuscated files and show a warning to try deobfuscatorDetect obfuscated files and show a warning to try deobfuscatorfeature closed user raghu16
#1923 Devilish Stylist: Some sprite are invisable.Devilish Stylist: Some sprite are invisable.bug closed user p0008874
#451 Dialogue windows are not showing on the center of the screen on a multi-monitor configurationDialogue windows are not showing on the center of the screen on a multi-monitor configurationbug closed user helmy
#1798 Difference between opcodes in AS3Difference between opcodes in AS3question closed user Kuroneko
#1671 Different image display color between exported file as PDF and PNGDifferent image display color between exported file as PDF and PNGbug closed user ahsanx
#570 Direct AS3 Edition bugDirect AS3 Edition bugbug closed user realmaster42
#945 Direct editation bugDirect editation bugbug closed user myztikrice
#1280 Direct editation of traits (methods, fields) with same nameDirect editation of traits (methods, fields) with same namefeature closed admin JPEXS
#931 Direct editation: (¬A) ∧ B = ¬(A ∧ B) ??Direct editation: (¬A) ∧ B = ¬(A ∧ B) ??bug closed user Anthony973
#1058 Direct editing as results in corrupt abc code.Direct editing as results in corrupt abc code.bug closed user Rymez2K
#518 Direct editing AS1/2: Cast operatorDirect editing AS1/2: Cast operatorbug closed developer honfika
#1467 Direct editing of AS2 doesn't save properlyDirect editing of AS2 doesn't save properlybug closed user SomebodyOnceToldMe
#165 direct lookupswitch / alchemy not supported - hiddendirect lookupswitch / alchemy not supported - hiddenbug closed developer honfika
#1594 Disable padding in p-code, use oldstyle getlocal_xDisable padding in p-code, use oldstyle getlocal_xfeature closed user Kuroneko
#460 Disable text horizontal autoscroll to the endDisable text horizontal autoscroll to the endfeature closed user megalol
#429 Disable/Enable rename identifiers feature (checkbox? button?).Disable/Enable rename identifiers feature (checkbox? button?).feature closed user solodarkban
#380 Displaying big .png images is very slowDisplaying big .png images is very slowbug closed user sydd
#568 dissappeared DefineText AS edit button in latest nightly + FlashPlayer.exe window after FFDec closing bug (again)dissappeared DefineText AS edit button in latest nightly + FlashPlayer.exe window after FFDec closing bug (again)bug closed user megalol
#21 Do-While and while loops inside ifDo-While and while loops inside ifbug closed user googleCode
#14 DoABC combobox sortingDoABC combobox sortingfeature closed user googleCode
#1588 DoAction tag for a frameDoAction tag for a framefeature closed user uranreactor
#819 Documentation for FFDECDocumentation for FFDECquestion new user yogicxl
#1691 Does JPEXS provide a mappings service?Does JPEXS provide a mappings service?question new user Krystilize
#1934 Does not export in full size pngDoes not export in full size pngbug closed user AntiGM
#730 Doesn't work if Flash ActiveX not installedDoesn't work if Flash ActiveX not installedbug closed user usroboticz
#2091 Doesn't work on Wine via ChromeOSDoesn't work on Wine via ChromeOSbug new user MesaBlack
#79 DoInitAction decompilation problemDoInitAction decompilation problembug closed user pepka
#1901 Double Click to Edit - Feature RequestDouble Click to Edit - Feature Requestfeature closed user Streaks225
#245 double spaces before and after "as" keyword in decomplied codedouble spaces before and after "as" keyword in decomplied codebug closed developer honfika
#1012 Downloaded lastest version it says cannot read swf file. The file has not got the SWF extension (.swf) in its nameDownloaded lastest version it says cannot read swf file. The file has not got the SWF extension (.swf) in its namebug closed user lordbarby
#1372 drag & drop moving charactersdrag & drop moving charactersfeature closed user Owyn
#117 Drag&Drop supportDrag&Drop supportfeature closed user focus
#127 Drag-drop exportable item from treeDrag-drop exportable item from treefeature closed user focus
#22 dup, setlocal issuedup, setlocal issuebug closed user googleCode
#1966 Duplicate case labelDuplicate case labelbug closed user ngocchinhlqd
#1088 EcmaScript number to string conversion wrongEcmaScript number to string conversion wrongbug closed developer honfika
#1417 Edit actionScript needs fixingEdit actionScript needs fixingbug invalid user RadiatedFox
#515 Edit AS3 directlyEdit AS3 directlyfeature closed user Requi
#780 Edit ButtonEdit Buttonfeature new user realmaster42
#1231 Edit buttons sizeEdit buttons sizequestion closed user megalol
#712 Edit DefineShapeEdit DefineShapefeature closed user Tolkne
#2039 Edit Devilish stylistEdit Devilish stylistquestion opened user Gamingdude19
#2173 Edit function by itself without modifying the whole classEdit function by itself without modifying the whole classbug new user Colly
#169 edit method body raw bytesedit method body raw bytesfeature closed developer honfika
#1715 Edit mode is not disabled on switching to Text Search result (other AS)Edit mode is not disabled on switching to Text Search result (other AS)bug closed user uzer0
#1433 Edit multiple frames/PlaceObjects at onceEdit multiple frames/PlaceObjects at oncequestion new user plug_clock
#41 Edit of public static constants don't workEdit of public static constants don't workbug ignored user googleCode
#922 Edit text rendering: position is wrongEdit text rendering: position is wrongbug closed developer honfika
#2008 Editing a specific function's p-code throws an unexpected errorEditing a specific function's p-code throws an unexpected errorbug closed user dimusLV
#562 Editing ActionScript 3 codeEditing ActionScript 3 codefeature closed user ThomasSpeedrunner
#306 editing AS directly bugediting AS directly bugbug closed developer honfika
#203 editing AS directly shows error when trying to saveediting AS directly shows error when trying to savebug closed developer honfika
#304 editing AS directly: local variable names are lostediting AS directly: local variable names are lostbug postponed developer honfika
#507 editing AS directly: object literal problemediting AS directly: object literal problembug closed user karl
#485 editing AS directly: unary minus signediting AS directly: unary minus signbug closed developer honfika
#1057 Editing as in editor results in package name moving. Editing as in editor results in package name moving. bug closed user Rymez2K
#1201 Editing code with switch/case seems to corrupt the SWF.Editing code with switch/case seems to corrupt the SWF.bug closed user junebeetle
#1580 Editing Import AssetsEditing Import Assetsquestion closed user Zonteak
#870 Editing shapeBoundsEditing shapeBoundsbug closed user yoburg
#1455 Editing SWF Made By SWF Players Like Instant DemoEditing SWF Made By SWF Players Like Instant Demofeature closed user sasatefa2009
#1326 Editing traits doesn't workEditing traits doesn't workbug closed user capasha
#805 Editor mode for Define*TextsEditor mode for Define*Textsfeature closed user megalol
#1042 Embed iframe to swf flash fileEmbed iframe to swf flash filefeature closed user nimeshramani
#152 Empty "if" bracnhes Empty "if" bracnhes bug closed developer honfika
#1970 Empty frames missing in decompiled fla, Auto rename identifiers not working without deobfuscationEmpty frames missing in decompiled fla, Auto rename identifiers not working without deobfuscationbug closed user Grubsic
#98 Empty initializers causing empty lines in decompiled codeEmpty initializers causing empty lines in decompiled codebug closed developer honfika
#433 EmptyStackException - Code may be obfuscatedEmptyStackException - Code may be obfuscatedbug closed user asd26
#509 EmptyStackException at decompilationEmptyStackException at decompilationbug closed user Requi
#246 encoding problem in issue notification emailencoding problem in issue notification emailbug closed developer honfika
#1224 Error "An error occurred while starting the application"Error "An error occurred while starting the application"bug closed user henke37
#1807 Error #1064, maybe related to constructprop vs callproperty?Error #1064, maybe related to constructprop vs callproperty?bug closed user NoobTracker
#1076 Error during export java null pointer exceptionError during export java null pointer exceptionbug closed user TheWatcher
#1854 Error during export: java.lang.NullPointerExceptionError during export: java.lang.NullPointerExceptionbug closed user Shokry
#2120 error exporting files (File name too long)error exporting files (File name too long)bug upgraded user higoka
#19 error for export code with * packageerror for export code with * packagebug ignored user googleCode
#1818 Error importing previously exported SWL XMLError importing previously exported SWL XMLbug closed user Herobrine24
#2081 error on compile with object literalerror on compile with object literalquestion opened user 3plus4i
#1560 Error on compiling - $$goto is not availableError on compiling - $$goto is not availablebug closed user teliosmetonma
#930 Error on installError on installbug closed user sky
#1667 error on save AS scripterror on save AS scriptbug closed user x29r
#933 Error Upon Declaring ArraysError Upon Declaring Arraysbug closed user Anthony973
#1859 Error when editing ActionScript 3 P-CodeError when editing ActionScript 3 P-Codebug closed user nosamu
#1053 Error when save edit.Error when save edit.bug closed user nhattuan
#147 escape filenames during (obfuscated) as exportescape filenames during (obfuscated) as exportbug closed developer honfika
#1111 Examples of CLI replace commandExamples of CLI replace commandquestion closed user anthony
#1868 Exception when trying to raw edit some values in PlaceObject MatrixException when trying to raw edit some values in PlaceObject Matrixbug closed user STA20
#115 exits with exception on mac osexits with exception on mac osbug closed user makc
#1212 Export .pdf with fonts.Export .pdf with fonts.feature closed user Spr
#778 export ActionScript embeded with canvasexport ActionScript embeded with canvasquestion closed user yogicxl
#811 Export ActionScript failExport ActionScript failbug closed user uragan1987
#864 Export and Replace ShapesExport and Replace Shapesfeature closed user Pluckerpluck
#1373 Export as searchable PDFExport as searchable PDFfeature closed user Bynari
#257 Export AS2 swf to FLA: TextField export issuesExport AS2 swf to FLA: TextField export issuesbug closed user focus
#2164 export as3 with assets.swf will set hasEndTag with trueexport as3 with assets.swf will set hasEndTag with truebug new user ukuq
#168 export command in the tree context menuexport command in the tree context menufeature closed developer honfika
#564 Export Define*Texts to one text file (with separator)Export Define*Texts to one text file (with separator)feature closed user megalol
#2119 export files with their actual name instead of idexport files with their actual name instead of idfeature closed user higoka
#229 Export FLA issue with text fieldExport FLA issue with text fieldbug closed user focus
#230 Export FLA issue with vector graphics strokeExport FLA issue with vector graphics strokebug closed user focus
#184 Export FLA issues: incorrect Linked Video objectExport FLA issues: incorrect Linked Video objectbug closed user focus
#183 Export FLA issues: wrong stage sizeExport FLA issues: wrong stage sizebug closed user focus
#311 Export FLA: bitmap usage exported incorrectlyExport FLA: bitmap usage exported incorrectlybug closed user focus
#251 Export FLA: drop shadow filter strength incorrectExport FLA: drop shadow filter strength incorrectbug closed user focus
#262 Export FLA: dynamic text fields fonts not embeddedExport FLA: dynamic text fields fonts not embeddedfeature closed user focus
#305 Export FLA: empty sound layersExport FLA: empty sound layersbug closed user focus
#360 Export FLA: empty sound layers (2)Export FLA: empty sound layers (2)bug closed user focus
#259 Export FLA: exported image looks not same as originalExport FLA: exported image looks not same as originalbug closed user focus
#310 Export FLA: exported shapes thinner that originalExport FLA: exported shapes thinner that originalbug closed user focus
#235 Export FLA: incorrect Dynamic Text Fields coordinates.Export FLA: incorrect Dynamic Text Fields coordinates.bug closed user focus
#252 Export FLA: incorrect position and width of the text field with blur filterExport FLA: incorrect position and width of the text field with blur filterbug closed user focus
#308 Export FLA: incorrect static text X coordinateExport FLA: incorrect static text X coordinatequestion closed user focus
#260 Export FLA: labels issuesExport FLA: labels issuesbug closed user focus
#524 Export FLA: mask layer is not applied to the child layerExport FLA: mask layer is not applied to the child layerbug closed user focus
#185 Export FLA: no on-clip actions exportedExport FLA: no on-clip actions exportedbug closed user focus
#261 Export FLA: place on-frame scripts in first separate layer, not last oneExport FLA: place on-frame scripts in first separate layer, not last onefeature closed user focus
#312 Export FLA: shape tween not exportedExport FLA: shape tween not exportedbug closed user focus
#309 Export FLA: static text letter spacing is incorrectExport FLA: static text letter spacing is incorrectbug closed user focus
#250 Export FLA: Static text spacing and marigins are not restored.Export FLA: Static text spacing and marigins are not restored.bug closed user focus
#307 Export FLA: TextField's properties exported incorrectlyExport FLA: TextField's properties exported incorrectlybug closed user focus
#295 Export FLA: wrong fontExport FLA: wrong fontbug closed user focus
#1082 Export Frame as avi fileExport Frame as avi filebug closed user jayaramu
#2011 Export frame as PNG with transparent backgroundExport frame as PNG with transparent backgroundquestion new user JustNao
#1863 export frame errorexport frame errorbug closed user nissanjp
#976 Export frame with zoom by commandExport frame with zoom by commandquestion closed user anhisme
#1266 Export frames to animated gif with transparent backgroundExport frames to animated gif with transparent backgroundfeature closed user 3KyNoX
#1362 Export images from list of SWF files to single directoryExport images from list of SWF files to single directoryfeature closed user bochratoon12
#920 Export instance name to SVG use elementExport instance name to SVG use elementfeature closed user lroos
#2181 Export morhphshape as start and end bounds for editingExport morhphshape as start and end bounds for editingfeature new user Poiuy2
#1080 Export movie not workingExport movie not workingbug closed user jayaramu
#1735 Export multiple opened sfw at the same time.Export multiple opened sfw at the same time.bug closed user bendknee
#1445 Export obscuration swf fail  when class path have spaceExport obscuration swf fail when class path have spacebug closed user xf5464
#921 Export of html DefineEditText to SVGExport of html DefineEditText to SVGfeature closed user lroos
#1508 Export PNG in fully qualityExport PNG in fully qualityquestion closed user SmashJosh
#296 Export save dialog goes upper and upper in the directory treeExport save dialog goes upper and upper in the directory treebug closed developer honfika
#2001 Export single AS3 P-code method with body IDExport single AS3 P-code method with body IDfeature new user nosamu
#1290 Export source to ProjectsExport source to Projectsfeature new user solodarkban
#616 Export sprite as pngExport sprite as pngbug closed user Player
#1753 Export sprite PNG or SVG only export first frameExport sprite PNG or SVG only export first framequestion opened user maximiliano
#1454 Export Sprites as SWF?Export Sprites as SWF?bug closed user Dokta_Whawee
#1786 export swf to pdf has errorsexport swf to pdf has errorsbug closed user urkere
#1941 Export SWF XML button does not work without selecting an item firstExport SWF XML button does not work without selecting an item firstbug closed user nosamu
#943 Export to CS4 and lowerExport to CS4 and lowerfeature closed user myztikrice
#1096 Export to FLA "SEVERE Petty print error"Export to FLA "SEVERE Petty print error"bug closed user ViggyNash
#136 Export to FLA issuesExport to FLA issuesbug closed user focus
#1782 Export to FLA not workingExport to FLA not workingbug closed user amusedpenguin
#1860 Export to FLA not workingExport to FLA not workingbug closed user Puzzlecube
#980 Export to Fla ProblemsExport to Fla Problemsbug closed user dbk
#209 Export to FLA: incorrect Static Fields Y position.Export to FLA: incorrect Static Fields Y position.bug closed user focus
#1068 Export to Flash failed with message of java casting problem GRADIENT to FOCAL GRADIENTExport to Flash failed with message of java casting problem GRADIENT to FOCAL GRADIENTbug closed user winxalex
#1812 Export to older FLA versionsExport to older FLA versionsfeature postponed user drenched_cabbage
#1504 Export to XFLExport to XFLfeature postponed user solodarkban
#414 exportActionScript but get starkoverflow error or nullexportActionScript but get starkoverflow error or nullbug closed user dingo
#2135 Exported FLA is missing FrameScripts on the symbolsExported FLA is missing FrameScripts on the symbolsbug closed user wolf_haley
#1553 exported images could not be displayedexported images could not be displayedbug closed user nissansz
#1233 Exported images with transparency look differentExported images with transparency look differentbug closed user eyal.katz
#1153 Exported JPEG Images are invalidExported JPEG Images are invalidbug closed user MurphyRadio
#1347 Exported JPG images can't be openedExported JPG images can't be openedbug closed user fancool
#1996 Exported texts out of orderExported texts out of orderbug returned user auroraegold
#481 Exporting Exporting bug closed user ishra
#2019 Exporting .SWF to .GIF is missing shapes in .GIFExporting .SWF to .GIF is missing shapes in .GIFquestion opened user SphinxRa28
#1839 Exporting a sprite as PNG does not generate expected resultExporting a sprite as PNG does not generate expected resultbug closed user TheIceCreamBear
#648 Exporting binary data in embedded swfExporting binary data in embedded swfbug closed user bossfong
#2041 Exporting decompiled codeExporting decompiled codefeature closed user RenderDragon
#96 Exporting FLA not working with the attached swfExporting FLA not working with the attached swfbug closed developer honfika
#180 Exporting FLA... for everExporting FLA... for everbug closed user focus
#714 Exporting frames as HTML Canvas throws error - "java.lang.NullPointerException: null "Exporting frames as HTML Canvas throws error - "java.lang.NullPointerException: null "bug closed user bradnyk
#333 Exporting is very slow, and generates a huge output file.Exporting is very slow, and generates a huge output file.bug closed developer honfika
#1051 Exporting multiple filesExporting multiple filesquestion closed user loert423
#2005 Exporting multiple files : naming problemExporting multiple files : naming problembug closed user rayakev8
#737 Exporting ScriptsExporting Scriptsfeature closed user ankilla
#553 Exporting slows down the closer it gets to finishExporting slows down the closer it gets to finishbug invalid user end0re
#1333 Exporting sprites as swf filesExporting sprites as swf filesfeature closed user realmaster42
#677 Exporting Sprites, Higher ResolutionExporting Sprites, Higher Resolutionfeature closed user Farsha
#1829 Exporting to AVI adds extra pixel line to width and heightExporting to AVI adds extra pixel line to width and heightbug closed user JimPancakes
#814 Exporting with scale problemExporting with scale problembug closed user kallavun
#1837 Expression lost in MovieClips' constructor.Expression lost in MovieClips' constructor.bug closed user CoolBreeze
#1757 Exrctracted swf files are not indexedExrctracted swf files are not indexedfeature closed user plendina
#1756 Extending or Implementing classesExtending or Implementing classesfeature new user PDEVI2
#1870 extends class return Error #1014: Class xxxx could not be foundextends class return Error #1014: Class xxxx could not be foundbug closed user irajab
#914 External player can be closed with Alt-F4External player can be closed with Alt-F4bug postponed developer honfika
#293 Extra line break on forums (again)Extra line break on forums (again)bug closed user focus
#194 Extra line endings in the Issues descriptionsExtra line endings in the Issues descriptionsbug closed user focus
#1170 Extract from Memory in Command LineExtract from Memory in Command Linefeature closed user goodffdecnameok
#1099 Extract swf that is inside a swf binary.Extract swf that is inside a swf binary.question closed user appleseed
#2046 Extracting embedded assets from SWFExtracting embedded assets from SWFfeature closed user RenderDragon
#769 Extracting resources twice makes them differentExtracting resources twice makes them differentquestion closed user capasha
#1013 Fail to save any SWF that was modified.Fail to save any SWF that was modified.bug closed user Djamana
#1101 Failed to compile [BUG PROGRAM]Failed to compile [BUG PROGRAM]bug closed user joseckz
#1778 Failed to Install - Java requiredFailed to Install - Java requiredquestion opened user pippasoul2
#1110 Failed to start JPEXSFailed to start JPEXSbug closed user XELAD2
#1879 False "tag order error"False "tag order error"bug closed user STA20
#685 Feature "Local variables and method parameters take name from debug" becomes a problem with some sourcesFeature "Local variables and method parameters take name from debug" becomes a problem with some sourcesbug closed user alvaromat
#985 Features request: Stretch shape to fit image. JPEG tags with transparency. Features request: Stretch shape to fit image. JPEG tags with transparency. feature closed user laforet
#2075 FF dec doesn't see any fileFF dec doesn't see any filebug opened user OlgaS
#1041 FFDec (java) package names in decompiled AS codeFFDec (java) package names in decompiled AS codebug closed developer honfika
#271 FFDEC 1.6.6u2 is faster than FFDEC 1.6.7FFDEC 1.6.6u2 is faster than FFDEC 1.6.7bug closed user capasha
#1855 Ffdec 15.0 is slower than ffdec 14.6Ffdec 15.0 is slower than ffdec 14.6question opened user Kshatriya
#97 FFDec asks for Java 1.6.0FFDec asks for Java 1.6.0other closed user kuro
#418 FFDec can't deobfuscate some tricks used in SecureSWF 4.5FFDec can't deobfuscate some tricks used in SecureSWF 4.5bug closed user focus
#133 FFDec can't open big obfuscated as3 swfFFDec can't open big obfuscated as3 swfbug closed user focus
#131 FFDec can't open obfuscated swfFFDec can't open obfuscated swfbug closed user focus
#253 FFDec doesn't show any error message after writing to the file opened in another appFFDec doesn't show any error message after writing to the file opened in another appbug closed user focus
#798 ffdec doesn't show what it's exportingffdec doesn't show what it's exportingfeature closed user capasha
#1459 FFDEC FAILS TO SAVEFFDEC FAILS TO SAVEbug closed user Help
#1499 ffdec fails to start: Could not initialize class com.jpexs.decompiler.flash.configuration.Configurationffdec fails to start: Could not initialize class com.jpexs.decompiler.flash.configuration.Configurationbug closed user nnyby
#156 FFDec freeze after second searchFFDec freeze after second searchbug closed user focus
#1721 FFDec hangs at 100% while reading SWFFFDec hangs at 100% while reading SWFbug closed user Tayy25
#361 FFDec icon is not visible on application startFFDec icon is not visible on application startbug closed developer honfika
#897 FFDec is not starting when classic (non-ribbon) UI is selectedFFDec is not starting when classic (non-ribbon) UI is selectedbug closed user vs.
#1286 FFDEC not launching Mac OS 10.11. See this related thread on stackoverflow: http://stackoverflow.com/questions/32574790/java-app-no-longer-runs-under-os-x-10-11-el-capitanFFDEC not launching Mac OS 10.11. See this related thread on stackoverflow: http://stackoverflow.com/questions/32574790/java-app-no-longer-runs-under-os-x-10-11-el-capitanbug closed user georgechamplin
#952 FFDec not loading SWF without file extensionFFDec not loading SWF without file extensionbug closed user poxyran
#2053 FFDec not properly launchingFFDec not properly launchingbug upgraded user soricreator93
#378 FFDec reload doesn't applies translation to the context menuFFDec reload doesn't applies translation to the context menubug closed user focus
#1624 Ffdec saved only one search resultFfdec saved only one search resultbug closed user Kuroneko
#776 FFDec stop working at all after setting "number of threads" to 0 FFDec stop working at all after setting "number of threads" to 0 bug closed user kurzedmetal
#1613 Ffdec unclicked scripts bugFfdec unclicked scripts bugbug new user Kuroneko
#1705 FFDEC won't loadFFDEC won't loadbug postponed user Crashbreaker
#1236 ffdec won't openffdec won't openbug closed user bluep1x
#1477 FFDec won't open when trying to load a swf file which contains Japanese characters from context menuFFDec won't open when trying to load a swf file which contains Japanese characters from context menubug closed user Berni11
#2133 ffdec.sh script is broken on some Java distributionsffdec.sh script is broken on some Java distributionsbug closed user rayyaw
#623 ffdec.sh should be executable and have UNIX line endingsffdec.sh should be executable and have UNIX line endingsbug closed user rvighne
#49 ffdec.sh should have UNIX-style line endingsffdec.sh should have UNIX-style line endingsbug closed user googleCode
#826 ffdec.sh should have UNIX-style line endings (again)ffdec.sh should have UNIX-style line endings (again)bug closed user loki
#216 field orderfield orderquestion closed developer honfika
#1241 File content is different to what FFDEC shows in HEX view near instructionsFile content is different to what FFDEC shows in HEX view near instructionsbug closed user Owyn
#586 Filter rendering bugFilter rendering bugbug closed developer honfika
#627 Filter swf not workingFilter swf not workingbug closed user bossfong
#1458 Find bar is overlaying horizontal scrollbarFind bar is overlaying horizontal scrollbarbug closed user fwr11
#134 Find main (document) classFind main (document) classfeature closed user focus
#1609 First frame missing when exporting frames to PDF.First frame missing when exporting frames to PDF.bug closed user Do2
#53 first ternary operator expression is always truefirst ternary operator expression is always truefeature closed user googleCode
#72 first ternary operator expression is always truefirst ternary operator expression is always truebug closed user removs
#903 FLA export - null fontName, missing ShowFrameTagFLA export - null fontName, missing ShowFrameTagbug closed user intidigital
#1902 FLA export does not include some shape fill stylesFLA export does not include some shape fill stylesbug upgraded user nosamu
#1836 FLA Export failsFLA Export failsbug closed user atrus
#1732 FLA Export missing addFrameScript() callsFLA Export missing addFrameScript() callsbug closed user wolf_haley
#1903 FLA export of character is missing an eyeFLA export of character is missing an eyebug upgraded user nosamu
#282 FLA Export: Other formats than CS6FLA Export: Other formats than CS6feature closed user linajin
#1631 Flash ActiveX won't install when installing latest releaseFlash ActiveX won't install when installing latest releasebug closed user LukePlays
#2208 flash is not supportedflash is not supportedquestion opened user PutaSiegaSordomuda
#1958 Flash Player Launches SWFs as -relaunchedFlash Player Launches SWFs as -relaunchedquestion closed user Nickelbath
#1288 Flash Player PathFlash Player Pathquestion closed user Gigabait
#124 Flash Plyer not found after opening swf from the command lineFlash Plyer not found after opening swf from the command linebug closed user focus
#2074 Flex Compiler feature doesn't workFlex Compiler feature doesn't workbug upgraded user Fancy2209
#763 FLEX MXML creationFLEX MXML creationfeature postponed user Xavier
#2111 Flex SDK 4.6Flex SDK 4.6question upgraded user akatsukicoline
#1801 Flex SDK not available on Adobe's official website anymoreFlex SDK not available on Adobe's official website anymorebug closed user cute_doge
#711 Folder preview is slow when there are 21000 items in the folderFolder preview is slow when there are 21000 items in the folderbug closed developer honfika
#1313 Font Change Font Change feature closed user shared_login
#462 Font embedding horizontal scrollingFont embedding horizontal scrollingfeature closed user megalol
#300 Font export (in FFDec and in .fla)Font export (in FFDec and in .fla)feature closed user megalol
#1581 Font export, some symbols are not correct like 。? though they can be shown correctlyFont export, some symbols are not correct like 。? though they can be shown correctlybug closed user nissansz
#794 Font extraction fails sometimesFont extraction fails sometimesbug closed user Anon
#1550 Font Missing name. Font Missing name. bug closed user nissansz
#1919 Font size changingFont size changingquestion closed user kesss
#539 for each loops does not generates "var" declarationfor each loops does not generates "var" declarationbug closed user ether
#1334 For loops converts automatic to while loopsFor loops converts automatic to while loopsbug closed user capasha
#13 for..in, for each..in differencefor..in, for each..in differencebug closed user googleCode
#715 Force Save helpForce Save helpquestion closed user LayneBasom
#971 forgotten assignment for increment in first lineforgotten assignment for increment in first linebug closed user BeniBela
#1928 Format for Shape replaceFormat for Shape replacequestion closed user mdali
#1210 Frame Export - CANVAS mode showing Java Lang Null pointer Error for certain .swfsFrame Export - CANVAS mode showing Java Lang Null pointer Error for certain .swfsbug closed user yogicxl
#738 Frame export fails with EndOfStreamException: Premature end of the stream reachedFrame export fails with EndOfStreamException: Premature end of the stream reachedbug closed user Peter
#1029 FrameExporter not working correctly in library buildFrameExporter not working correctly in library buildfeature closed user PatrikNusszer
#2196 FrameExporter, class cast exception to Timelined.FrameExporter, class cast exception to Timelined.question closed user Tayker
#1825 Frames adding featureFrames adding featurefeature closed user bustleevars
#1767 Frames and SpritesFrames and Spritesfeature new user AndrewAssassins
#558 Frames as SVGFrames as SVGfeature closed user psykauze
#387 Frames preview buggedFrames preview buggedbug closed user megalol
#1752 Free transform cursor option is broken on latest JPEXS versionsFree transform cursor option is broken on latest JPEXS versionsbug closed user Akira896
#1695 Free transform interface interactable points offset.Free transform interface interactable points offset.bug closed user GeekyGami
#1974 Freeze and very high memory usage while previewing framesFreeze and very high memory usage while previewing framesbug closed user nosamu
#1982 Freeze when previewing specific PlaceObject2 tagFreeze when previewing specific PlaceObject2 tagbug closed user nosamu
#649 Freezing when opening .gfx filesFreezing when opening .gfx filesbug closed user lostprophet
#496 French date formatFrench date formatother closed user gamuti
#5 FSCommand2 not supportedFSCommand2 not supportedfeature closed user googleCode
#1431 Function Beginning being removed in Button's codeFunction Beginning being removed in Button's codequestion closed user obs1d1an
#2040 gacha clubgacha clubquestion invalid user holas
#1930 Game crashes after editing codeGame crashes after editing codequestion opened user q9n8krepmz
#2088 game crashes just on adding a line breakgame crashes just on adding a line breakquestion closed user edynce
#2168 Game where debugger does not launchGame where debugger does not launchquestion opened user sweetjp157
#1437 garbled text in GUIgarbled text in GUIbug closed user Pons
#1303 garbled text when exporting frame with textgarbled text when exporting frame with textbug closed user babypandas
#1677 Get a "severe" error when opening a file.Get a "severe" error when opening a file.bug closed user STA20
#1287 Get rid of Unidentified Developer StatusGet rid of Unidentified Developer Statusfeature closed user MasterWex
#1700 Get spaces correctly in text from GlyphEntriesGet spaces correctly in text from GlyphEntriesquestion closed user georgiecasey
#472 getlex vs getlex Qname isn't the samegetlex vs getlex Qname isn't the samebug closed user capasha
#99 getLogger first parameter is wrong in 2 classesgetLogger first parameter is wrong in 2 classesbug closed developer honfika
#114 getPrecontinues(...) causes StackOverflowErrorgetPrecontinues(...) causes StackOverflowErrorbug closed user pepka
#2127 GetURL2 loadTargetFlag and loadVariablesFlag swapped on P-code panelGetURL2 loadTargetFlag and loadVariablesFlag swapped on P-code panelbug upgraded user nosamu
#1136 Gif Image are not workingGif Image are not workingquestion closed user Ricky
#2079 Gif to SpritesGif to Spritesfeature closed user modder69
#657 Global string searchGlobal string searchquestion closed user object
#2015 Globally rename identifierGlobally rename identifierbug closed user RenderDragon
#233 Globally rename identifier deselects currently selected script in left treeGlobally rename identifier deselects currently selected script in left treebug closed user focus
#379 Go to DefinitionGo to Definitionfeature ignored user cenadacoisa
#448 Go to document class is not working Go to document class is not working bug closed user helmy
#722 Go to next/previous frameGo to next/previous framefeature closed user ondra
#1 good job,mangood job,manother closed user googleCode
#1371 goto character idgoto character idfeature closed user Owyn
#227 gotoAndStop wrong frame indexgotoAndStop wrong frame indexbug closed user focus
#456 gotoMainClassOnStartup = true  advanced setting is not being applied when using the classic interfacegotoMainClassOnStartup = true advanced setting is not being applied when using the classic interfacebug closed user helmy
#556 gotoMainClassOnSturtup buggotoMainClassOnSturtup bugbug closed user Alexander
#158 graph repaint problemgraph repaint problembug closed developer honfika
#336 Graph window is too smallGraph window is too smallbug closed developer honfika
#1011 Graphical errors in the FLA file after decompilingGraphical errors in the FLA file after decompilingbug upgraded user Joeee
#1623 Gray line in p-code edit windowGray line in p-code edit windowbug closed user Kuroneko
#1485 GUI Night modeGUI Night modefeature closed user Owyn
#1386 Guide/Bibliography/Documentation for SWF reverse engineeringGuide/Bibliography/Documentation for SWF reverse engineeringother new user muhbytes
#1039 hhquestion invalid user swfdc
#137 hasNext problemhasNext problembug closed user csganja
#415 HaXe compiled SWF support.HaXe compiled SWF support.feature closed user yanrishatum
#1927 HehrheHehrhequestion invalid user mdali
#1388 helphelpquestion closed user TECHNIS
#278 help mehelp mequestion ignored user serde
#280 help mehelp mequestion invalid user serde
#422 help me pleasehelp me pleaseother closed user chat
#1775 HELP ME WITH DECOMPILING!HELP ME WITH DECOMPILING!bug closed user MrSweetAnanasek
#283 help plshelp plsquestion ignored user serde
#1207 Help. Need to understand these instructionsHelp. Need to understand these instructionsquestion closed user Alexa
#489 Hex decode very large integersHex decode very large integersfeature closed user henke37
#1238 Hi, is something going wrong when use the free flash decompiler,can you help me?Hi, is something going wrong when use the free flash decompiler,can you help me?bug closed user shirh19910112
#1612 Hide search params to additional params sectionHide search params to additional params sectionfeature closed user Kuroneko
#1601 Hide tips windowHide tips windowquestion closed user Kuroneko
#1419 Hide unnecessary script class filesHide unnecessary script class filesfeature new user RafatRifaie
#2050 Highlighting usages of a variable, field or a parameterHighlighting usages of a variable, field or a parameterfeature new user RenderDragon
#1946 Horizontal scroll bar on action script source blocked by quick findHorizontal scroll bar on action script source blocked by quick findfeature closed user GDA
#825 hot keys (and maybe new buttons on new panel) to switch to next or previous DefineTexthot keys (and maybe new buttons on new panel) to switch to next or previous DefineTextfeature closed user megalol
#1299 How can I add instance names to movieclips?How can I add instance names to movieclips?question closed user abbulssa
#1515 How can I change overall font size?How can I change overall font size?question closed user yotajac
#1496 How can I get rid of the spaces in the identifier name?How can I get rid of the spaces in the identifier name?question closed user LeoStitch
#1556 How can I replace a lot of Shape files with .png's?How can I replace a lot of Shape files with .png's?question opened user espvolt
#1956 How can I swap shapes (DefineShape (ID)) between swf files?How can I swap shapes (DefineShape (ID)) between swf files?question closed user Hermbeurg
#1296 How can one see the fully qualified class and package names?How can one see the fully qualified class and package names?question closed user vorta4
#1367 How do I change an RGBA fill colour to just RGB? Images not showing, can't save file.How do I change an RGBA fill colour to just RGB? Images not showing, can't save file.bug closed user dunc001
#1566 How do i change the name of a tag?How do i change the name of a tag?question closed user WrapperFan
#1525 How do i edit scripts using playerglobal?How do i edit scripts using playerglobal?question closed user UppercutMan
#1129 How do I enable ActionScript debugging?How do I enable ActionScript debugging?question closed user capasha
#1361 How do I get working .as files (AS3) from a 2009 gameHow do I get working .as files (AS3) from a 2009 gamequestion new user Daikenkini
#1708 how do i replace an image inside a frame?how do i replace an image inside a frame?question closed user Razkanaz
#1463 How do I replace shapes with PNG imagesHow do I replace shapes with PNG imagesquestion closed user yelehenabouk
#1635 How do I replace sprites with other images in my PC?How do I replace sprites with other images in my PC?question opened user MiuSchardo
#1696 How do I save an adjusted Matrix for a Placeobject2 tag?How do I save an adjusted Matrix for a Placeobject2 tag?question closed user epicsninja
#1350 How do I save modification to embedded binary dataHow do I save modification to embedded binary dataquestion closed user freiza
#1728 How Do I Stop Animations Loop?How Do I Stop Animations Loop?question closed user DarkKnight
#1994 How do i use -replace in CLI to actually replace AS3 pcode?How do i use -replace in CLI to actually replace AS3 pcode?bug closed user Penteste27
#1368 How do you use -replace in commandline?How do you use -replace in commandline?question closed user Varq
#2103 How does useGPU option works?How does useGPU option works?question new user Mokkor
#1447 How i can open this file?How i can open this file?question closed user danteg9
#1173 How is P-code ofsXXX generated?How is P-code ofsXXX generated?question closed user capasha
#1840 How to add "import" without "Edit ActionScript" ?How to add "import" without "Edit ActionScript" ?bug closed user asalan
#1317 How to add an include directment in AS2?How to add an include directment in AS2?question closed user idk
#1574 How to add new files?How to add new files?question closed user alfredosojr
#695 How to add new font to a swf fileHow to add new font to a swf filequestion closed user drajwer86
#1737 how to add new frames in a spritehow to add new frames in a spritefeature closed user daso132
#1710 How to add new traitHow to add new traitquestion closed user NicolasC
#1292 How to add Your Own Variables to a classHow to add Your Own Variables to a classquestion closed user Xploit
#2063 How to assign ActionScript to DefineSpriteHow to assign ActionScript to DefineSpritequestion closed user NEMAMENE
#541 How to calculate GlyphAdvanceHow to calculate GlyphAdvancequestion closed user rendu2mai
#1706 How to change shape of png sprite in swf file.How to change shape of png sprite in swf file.question closed user alfredosojr
#1967 how to change the swf used in an exehow to change the swf used in an exequestion opened user maple
#1519 How to change/add a sound name?How to change/add a sound name?question closed user KnightOfTigers
#969 how to decompile and recompile?how to decompile and recompile?question closed user BeniBela
#1587 how to edit import if there is no pcode for ithow to edit import if there is no pcode for itquestion closed user shaun
#505 How to export DefineBinaryDataHow to export DefineBinaryDataquestion closed user rendu2mai
#1378 How to export pdf/gif/etc. with a transparent background?How to export pdf/gif/etc. with a transparent background?question closed user Bladescarr
#2051 How to filter items before exportHow to filter items before exportquestion opened user lorenzo_p
#1079 How to Globally rename identifier?How to Globally rename identifier?question opened user Suuper
#545 How to identify which fonts AS scripts is usingHow to identify which fonts AS scripts is usingquestion closed user rendu2mai
#1536 How to import a font into an SWFHow to import a font into an SWFquestion closed user murkalurk2099
#1720 How to import textHow to import textquestion opened user NicolasC
#1843 How to make sure new images and sounds load inHow to make sure new images and sounds load inquestion closed user Luxe3710
#995 How to read that decompile result?How to read that decompile result?bug closed user Serj
#1282 how to replace music and images in a flash?how to replace music and images in a flash?question closed user cookiefonster
#1370 How to resize a sprite?How to resize a sprite?question opened user realmaster42
#2187 How to update `max_stack`?How to update `max_stack`?question closed user SamHoque
#231 Https support in "Open via proxy"Https support in "Open via proxy"feature new developer honfika
#1374 I am trying to copy tag with dependencies to another swf file but it messes up the scroll bar.I am trying to copy tag with dependencies to another swf file but it messes up the scroll bar.bug closed user timmy01502
#1554 I can't able to open the exported .bin file in raw formI can't able to open the exported .bin file in raw formquestion invalid user Amish2
#904 I can't export imagesI can't export imagesbug closed user capasha
#1862 I canno export from multiple filesI canno export from multiple filesbug closed user fjasdhkjha
#1215 i cant find advanced sttings on german version i cant find advanced sttings on german version bug closed user zealotta
#1441 I have installed the JPEXS decompiler but it isn't working. I have installed the JPEXS decompiler but it isn't working. bug invalid user tayobalogun
#31 i need help it wont let me open a file that ive used before in asdeci need help it wont let me open a file that ive used before in asdecbug closed user googleCode
#2035 I need help to modify my swf and playing it on my clientI need help to modify my swf and playing it on my clientbug closed user raizel
#1792 I need help with alpha propertyI need help with alpha propertyquestion closed user Kuroneko
#782 I need to replace a shape with another shape from SWF without loosing quality of image, how to?I need to replace a shape with another shape from SWF without loosing quality of image, how to?question closed user devsaider
#1524 I want to change font but I don't have knowledge about gfx at all :(I want to change font but I don't have knowledge about gfx at all :(question closed user wnsip
#1046 I want to run two ffdecI want to run two ffdecfeature closed user capasha
#1297 I'd like to insert actionscript.I'd like to insert actionscript.question closed user abbulssa
#1315 Icon sorting shows the wrong direction. Icon sorting shows the wrong direction. bug closed user shared_login
#1654 IconsIconsfeature closed user Kuroneko
#1295 IDENTIFIER or THIS or SUPER or STRING_OP expected but BRACKET_OPEN foundIDENTIFIER or THIS or SUPER or STRING_OP expected but BRACKET_OPEN foundbug postponed user babypandas
#1038 IDENTIFIER or THIS or SUPER or STRING_OP expected but LENGTH found on line 92IDENTIFIER or THIS or SUPER or STRING_OP expected but LENGTH found on line 92bug closed user jstar88
#75 If ... return, Commands in while condition (comma operator)If ... return, Commands in while condition (comma operator)bug closed user pepka
#238 if block contents are missingif block contents are missingbug closed developer honfika
#46 if then else with empty branches gets ignoredif then else with empty branches gets ignoredbug closed user googleCode
#28 ifne is ifeqifne is ifeqbug ignored user googleCode
#1305 IGGY File Format - fonts, etc.IGGY File Format - fonts, etc.feature opened user michalss
#2002 IGGY File import not working for Love Live ArcadeIGGY File import not working for Love Live Arcadebug new user goilup
#689 Ignore Case not correctly toggledIgnore Case not correctly toggledbug closed user koen
#1420 Ignore specific packages when using the Text Search toolIgnore specific packages when using the Text Search toolfeature new user RafatRifaie
#89 Illegal field names leads to decompilation issuesIllegal field names leads to decompilation issuesbug closed user jduncanator
#1957 Illegal operation error when it translate back the scriptIllegal operation error when it translate back the scriptbug closed user FemLol
#1808 Illegal overrideIllegal overridebug closed user NoobTracker
#537 IllegalOperationError is used without importing flash.errors.IllegalOperationErrorIllegalOperationError is used without importing flash.errors.IllegalOperationErrorbug closed user ether
#1788 Im very new to moddingIm very new to moddingquestion opened user JamJamOne
#1576 image export not creating filesimage export not creating filesbug closed user Blueroses
#1848 Image is in needed characters list of shape, but shape isn't in dependent characters list of imageImage is in needed characters list of shape, but shape isn't in dependent characters list of imagequestion new user Chicken
#1332 Image not appearingImage not appearingbug closed user idk
#1900 Image Transform Image Transform feature closed user modder69
#2171 Images appearing as solid red in ffdec and upon export.Images appearing as solid red in ffdec and upon export.question closed user IC300JB
#1000 Images export fails for malformed JPEG3 tagsImages export fails for malformed JPEG3 tagsbug closed user laforet
#1552 images in frame:canvas are all black, not showing correctly.images in frame:canvas are all black, not showing correctly.bug closed user nissansz
#751 Implement filters as shadersImplement filters as shadersfeature new developer honfika
#1543 Import .as to a swfImport .as to a swfquestion closed user Shiro
#491 Import a fontImport a fontfeature closed user gamuti
#1164 Import Assets withour ImportAssets tag. Check here how is it possibleImport Assets withour ImportAssets tag. Check here how is it possiblefeature postponed user Brandon
#1585 Import colored svg file after I exported it and changed the colorsImport colored svg file after I exported it and changed the colorsbug closed user LorenVidican
#563 Import DefineTexts (formatted [and plain if possible]) from exported .txt filesImport DefineTexts (formatted [and plain if possible]) from exported .txt filesfeature closed user megalol
#845 Import exported AS1/2 (DefineButton2&DefineSprite) buttonImport exported AS1/2 (DefineButton2&DefineSprite) buttonfeature closed user megalol
#1561 Import font data (kerning, ascent, descent, etc.)Import font data (kerning, ascent, descent, etc.)feature closed user RadRussianRus
#1471 Import Script not workingImport Script not workingquestion closed user Help
#929 Import Script?Import Script?question closed user Sandor
#724 Import shapesImport shapesfeature closed user Zizi17
#1727 Import SWF XML ErrorImport SWF XML Errorbug closed user Sheep
#2104 Import text errorImport text errorbug upgraded user rainssong
#1397 Import/add shapesImport/add shapesquestion closed user Katan025
#1377 Import/export <constant_string>Import/export <constant_string>feature new user SileNTViP
#701 Import/replace TTFImport/replace TTFfeature closed user michalss
#1446 Imported PNGs doesn't feature antialiasingImported PNGs doesn't feature antialiasingbug closed user Katan025
#1979 Imported SVG Graphics Bug Out During Test RunImported SVG Graphics Bug Out During Test Runbug closed user TheGamingMackV
#1436 Importing a scripts folder only imports scripts already in the SWF fileImporting a scripts folder only imports scripts already in the SWF filefeature new user DavidJCobb
#1666 Importing an XML file is throwing an errorImporting an XML file is throwing an errorbug closed user heyo1
#389 Importing from subFonts (choose from one of family Font)Importing from subFonts (choose from one of family Font)feature closed user megalol
#546 Importing previously-exported PNG filesImporting previously-exported PNG filesfeature closed user ThomasSpeedrunner
#1267 Importing SVG creates empty fillStyles arrayImporting SVG creates empty fillStyles arrayquestion closed user fratti
#334 importing to fonts characters presetsimporting to fonts characters presetsfeature closed user megalol
#970 Imports of variablesImports of variablesbug closed user BeniBela
#1189 imports sortingimports sortingfeature closed user BeniBela
#790 Impossible to change letters under a fontImpossible to change letters under a fontbug closed user gamuti
#756 Impossible to edit scripts after playing swfImpossible to edit scripts after playing swfbug closed user gamuti
#486 Impossible to search text in parameters under all DefineTextImpossible to search text in parameters under all DefineTextfeature ignored user gamuti
#2064 Improve Exporting and Importing of SVG filesImprove Exporting and Importing of SVG filesbug new user MeowOfDoom
#1738 Improved decompilation using iinitImproved decompilation using iinitfeature closed user xenni
#1390 Improved filter when exportingImproved filter when exportingfeature new user Lambda
#2105 Include fileName string into Basic tag info tab.Include fileName string into Basic tag info tab.feature upgraded user Mokkor
#2134 Include scenes from DefineSceneAndFrameLabelData in exported FLA/XFLInclude scenes from DefineSceneAndFrameLabelData in exported FLA/XFLfeature closed user nosamu
#2047 incorporate doswf decryption/deobfuscationincorporate doswf decryption/deobfuscationfeature new user jhill
#990 Incorrect colors after exporting imageIncorrect colors after exporting imagebug closed user Serj
#175 Incorrect decompilation (can't compile back)Incorrect decompilation (can't compile back)bug closed user focus
#1070 Incorrect decompilation of switch statementIncorrect decompilation of switch statementbug closed user Brandon
#446 incorrect decompiled code incorrect decompiled code bug closed user helmy
#1133 Incorrect frame order for nested spriteIncorrect frame order for nested spritebug closed user tenmin
#902 Incorrect line on debuggingIncorrect line on debuggingquestion closed user albfan
#1651 Incorrect merging of mask layers with content layersIncorrect merging of mask layers with content layersbug closed user henke37
#1244 Incorrect showing of NOP instructionsIncorrect showing of NOP instructionsbug closed user Owyn
#1932 Incorrect sprite animationIncorrect sprite animationbug closed user pim
#263 Infinite decompilation (AS3)Infinite decompilation (AS3)bug closed user focus
#105 Infinite loopsInfinite loopsbug closed user pepka
#221 Infinite searchInfinite searchbug closed user focus
#153 Infinite search -> Obfuscated code, OutOfMemoryErrorInfinite search -> Obfuscated code, OutOfMemoryErrorbug closed user focus
#2167 Injected ExportAssets give errorsInjected ExportAssets give errorsquestion opened user TechX
#923 Inline edit breaks code consistencyInline edit breaks code consistencybug closed user phantasm
#15 Inline functions as AVM instructionsInline functions as AVM instructionsbug closed user googleCode
#36 Inserting multiname with non existing indexInserting multiname with non existing indexbug closed user googleCode
#808 Installer downloads and installs Java 6, then it shows Old JRE foundInstaller downloads and installs Java 6, then it shows Old JRE foundbug closed developer honfika
#713 Installer for 4.0 fails to access Adobe WebsiteInstaller for 4.0 fails to access Adobe Websitebug closed user 1nd1g0
#1142 Installer localization files are not included in ffdex_xx_lang.zipInstaller localization files are not included in ffdex_xx_lang.zipbug closed developer honfika
#34 instead of "while(_loc5_ < 65536)" we have " while(_loc5_ >= 65536)".instead of "while(_loc5_ < 65536)" we have " while(_loc5_ >= 65536)".bug closed user googleCode
#619 Interactivity supportInteractivity supportfeature postponed user psykauze
#538 Interface are sometimes dynamicInterface are sometimes dynamicbug closed user ether
#1421 Internal error when trying to click 'Save' in the 'Edit Actionscript' panelInternal error when trying to click 'Save' in the 'Edit Actionscript' panelbug closed user NafrayuMiriyu
#1211 Internal SWF player enhancementsInternal SWF player enhancementsfeature new user megalol
#894 internal use of libraryinternal use of libraryquestion closed user chinmayvb
#760 Internal viewer line linear gradient fill is not workingInternal viewer line linear gradient fill is not workingbug closed developer honfika
#1675 Internal viewer viewport/zoom bugsInternal viewer viewport/zoom bugsbug closed user STA20
#1684 Internal viewer: no subsprite animationsInternal viewer: no subsprite animationsbug closed user STA20
#1535 Interpreting XFLInterpreting XFLquestion closed user pongstylin
#25 Invalid importsInvalid importsbug closed user googleCode
#961 Invalid recursion in Graph.finalProcessInvalid recursion in Graph.finalProcessbug closed developer honfika
#1184 Invalid regular expression generatedInvalid regular expression generatedbug closed user BeniBela
#503 Invalid shapes in .flaInvalid shapes in .flabug upgraded user wewixosa
#1917 Invalid SoundInvalid Soundquestion closed user modder69
#1510 Invalid SWF file, wrong signatureInvalid SWF file, wrong signaturequestion closed user prasmatnus
#2026 Invalid SWF file, wrong signatureInvalid SWF file, wrong signaturequestion closed user 1123
#2188 Invalid SWF file, wrong signatureInvalid SWF file, wrong signaturequestion closed user 1123
#1451 invalid swf file, wrong signature.invalid swf file, wrong signature.other closed user nus2ss
#1544 invalid swf file, wrong signature.invalid swf file, wrong signature.bug invalid user wtfiwinomgs
#2028 invalid swf file, wrong signature.invalid swf file, wrong signature.question closed user 1123
#1085 Invalid SWF Wrong SignatureInvalid SWF Wrong Signaturequestion closed user will123
#1482 Invalid SWF Wrong SignatureInvalid SWF Wrong Signaturebug closed user yuno321
#1479 Invalid SWF Wrong Signature when try to open SWFInvalid SWF Wrong Signature when try to open SWFbug closed user Machow8
#1522 Invalid SWF, Wrong Signature Invalid SWF, Wrong Signature bug invalid user idah6
#2199 ios scripts decompilation errorios scripts decompilation errorbug opened user Hiosl
#2024 Is it possible to add class extends a parent class?Is it possible to add class extends a parent class?question opened user n2g7mutf8
#1856 Is it possible to convert from xml to pdf directly?Is it possible to convert from xml to pdf directly?feature closed user nissanjp
#1252 Is it possible to create a new method?Is it possible to create a new method?question closed user rogal
#784 Is it possible to disable spash screen at program start?Is it possible to disable spash screen at program start?question closed user megalol
#1291 Is it possible to move or rearrange image, button etc.?Is it possible to move or rearrange image, button etc.?feature closed user abbulssa
#1864 Is it possible to pass an xml or swf in stdin memory to ffdec to export pdf frame?Is it possible to pass an xml or swf in stdin memory to ffdec to export pdf frame?feature closed user nissanjp
#1702 Is it possible to replace morphshapes or change it in some way?Is it possible to replace morphshapes or change it in some way?question opened user madTeddy
#1293 Is it possible to replace movie clip?Is it possible to replace movie clip?question closed user abbulssa
#1853 Is it possible to run multiple cmd line for ffdec to convert swf to xml?Is it possible to run multiple cmd line for ffdec to convert swf to xml?feature closed user nissanjp
#1331 Is there a easier way to set "Allow Smoothing" for bitmap (in Flash Library)?Is there a easier way to set "Allow Smoothing" for bitmap (in Flash Library)?question closed user RadarNyan
#1852 Is there a way to replace sounds just like you can images?Is there a way to replace sounds just like you can images?question closed user Oskarzyca
#1876 Is there any method to join head and body files which are split by other users?Is there any method to join head and body files which are split by other users?feature closed user nissanjp
#1730 Is there any way I can force save the actionscript editor?Is there any way I can force save the actionscript editor?bug opened user AzurBlue
#992 Issue Tracker needs the ability to be reset. Label cannot be cleared except by clearing cookies!Issue Tracker needs the ability to be reset. Label cannot be cleared except by clearing cookies!question closed user 1nd1g0
#1115 Issue tracker: text search is slowIssue tracker: text search is slowbug closed developer honfika
#2175 Issue with Decompiling a Modified Flash 8 SWFIssue with Decompiling a Modified Flash 8 SWFbug upgraded user Crazyfs
#2072 issue with fully qualified namesissue with fully qualified namesbug closed user 3plus4i
#1298 Issue With RecompilingIssue With Recompilingbug closed user vorta4
#416 Issues list: Show the attachment size next to the attachmentsIssues list: Show the attachment size next to the attachmentsfeature closed developer honfika
#1330 Issues with direct editing of Actionscript 3Issues with direct editing of Actionscript 3bug closed user StormReaper
#110 Issues with [CLASS] TagsIssues with [CLASS] Tagsbug closed user jduncanator
#1989 it seems to break jpexsit seems to break jpexsbug closed user xxcoder
#35 Japanese stringsJapanese stringsbug closed user googleCode
#935 Java files in git repository are not eol-normalizedJava files in git repository are not eol-normalizedquestion closed user JackB
#1978 Java Heap Space ProblemJava Heap Space Problembug new user CottonFluffy
#1137 java.io.IOException: Cannot run program ""/usr/local/bin/flashplayer"": error=2, No such file or directoryjava.io.IOException: Cannot run program ""/usr/local/bin/flashplayer"": error=2, No such file or directorybug closed user coolspeedy6
#1569 java.lang.IndexOutOfBoundsException on actionscript editingjava.lang.IndexOutOfBoundsException on actionscript editingbug closed user crit
#557 java.lang.NUllPointerExceptionjava.lang.NUllPointerExceptionbug closed user capasha
#2084 java.lang.NullPointerExceptionjava.lang.NullPointerExceptionbug closed user zolaz
#2085 java.lang.NullPointerExceptionjava.lang.NullPointerExceptionbug closed user zolaz
#1779 java.lang.OutOfMemoryError: Java heap spacejava.lang.OutOfMemoryError: Java heap spacebug new user ComediNyan
#1488 java.util.EmptyStackException when trying to export a framejava.util.EmptyStackException when trying to export a framebug closed user alexv
#733 JavactiveX output not being captured?JavactiveX output not being captured?bug closed user CyberFoxx
#464 Javaw and ffdec open and closesJavaw and ffdec open and closesbug closed user capasha
#927 JNA problems - Crash Does not start & UnsatisfiedLinkError with java V 1.8JNA problems - Crash Does not start & UnsatisfiedLinkError with java V 1.8bug closed user codydbgt
#1084 Jpeg-XR supportJpeg-XR supportfeature closed user kks2003
#1952 jpex crash when searching memoryjpex crash when searching memorybug new user mmrr4
#2101 JPEXS CLI is not working on WindowsJPEXS CLI is not working on Windowsquestion closed user rayyaw
#772 JPEXs CrashesJPEXs Crashesbug closed user realmaster42
#1240 JPEXS does not use multiple threads for decompilation on Text SearchJPEXS does not use multiple threads for decompilation on Text Searchfeature closed user bossfong
#2025 JPEXS ffdec won't bootJPEXS ffdec won't bootbug upgraded user Adamillo
#940 JPEXS Flash Decompiler on Mac OS X Yosemite not runningJPEXS Flash Decompiler on Mac OS X Yosemite not runningbug closed user Help
#1272 JPEXS Free Flash Decompiler 9.0.0 Simplified Chinese language updateJPEXS Free Flash Decompiler 9.0.0 Simplified Chinese language updateother closed user dayanzai
#1285 JPEXS Free Flash Decompiler v.9.0.0 is removing flash.external.ExternalInterface; on saving the file. I want to communicate SWF through JS.JPEXS Free Flash Decompiler v.9.0.0 is removing flash.external.ExternalInterface; on saving the file. I want to communicate SWF through JS.bug ignored user Adee
#2012 JPEXS Free Flash Decomplier is trying to destroy my Computer from Lags.JPEXS Free Flash Decomplier is trying to destroy my Computer from Lags.other new user uy813
#1415 JPEXS Freezes when i close the flash debugger from outside of JPEXSJPEXS Freezes when i close the flash debugger from outside of JPEXSbug closed user RafatRifaie
#1579 JPEXS is not launching on Ubuntu 18.04JPEXS is not launching on Ubuntu 18.04bug closed user teliosmetonma
#1464 JPEXS not starting anymore after installing Flash Pro CS6JPEXS not starting anymore after installing Flash Pro CS6bug closed user RobinPanfu
#1964 JPEXS sometimes freeze out when I transform the object with the cursor in a spriteJPEXS sometimes freeze out when I transform the object with the cursor in a spritebug closed user FemLol
#1844 JPEXS won't load sprites/imagesJPEXS won't load sprites/imagesbug new user bobbilyking
#1456 JSyntaxPane editor not loading on Java 10JSyntaxPane editor not loading on Java 10bug closed user Help
#690 jump addresses to use when adding if statements to P-codejump addresses to use when adding if statements to P-codequestion closed user loki
#2062 jump addresses when editing P-codejump addresses when editing P-codequestion opened user 3plus4i
#1353 Jump to definitionJump to definitionfeature closed user henke37
#2045 Keep open tabsKeep open tabsfeature new user RenderDragon
#470 Keep original Define*Texts and DefineFonts panels size after resizing from full screen to windowed and backKeep original Define*Texts and DefineFonts panels size after resizing from full screen to windowed and backfeature closed user megalol
#1398 Keeps giving me the error massage "OutOfMemory error occurred. You are running 32bit Java on 64bit system. Please use 64bit Java." despite the fact that I do have a 64-bit java installedKeeps giving me the error massage "OutOfMemory error occurred. You are running 32bit Java on 64bit system. Please use 64bit Java." despite the fact that I do have a 64-bit java installedbug closed user JCrv
#748 languagelanguagequestion closed user ahmadahmar
#291 Language selection dialog is not translatableLanguage selection dialog is not translatablequestion closed user focus
#728 Large fontsLarge fontsbug closed user strelokhalfer
#1849 Large script(s) seem to cause possible overflow error when attempting to save modificationsLarge script(s) seem to cause possible overflow error when attempting to save modificationsbug closed user Badfitz66
#529 Larger binaryData files slow or impossible to view (in order to replace)Larger binaryData files slow or impossible to view (in order to replace)bug closed user Kev
#335 last opened files listlast opened files listfeature closed user megalol
#1380 Leaving JPEXS running for more than 1 day crashes my PCLeaving JPEXS running for more than 1 day crashes my PCbug closed user Zamasu
#2177 Leftover processes after "Invalid SWF, wrong signature" errorLeftover processes after "Invalid SWF, wrong signature" errorbug upgraded user nosamu
#1075 Lenght of DefineText is more larger than original when DefineText is savedLenght of DefineText is more larger than original when DefineText is savedquestion closed user gamuti
#549 lessequals instead of greaterequals p-code editinglessequals instead of greaterequals p-code editingbug closed user capasha
#683 Linkage name for extracted imagesLinkage name for extracted imagesfeature closed user jdibbert
#1783 Linkage TagsLinkage Tagsquestion opened user Speedox12
#681 Linux quoted parameters from other script not parsed as single fileLinux quoted parameters from other script not parsed as single filebug closed user loki
#653 Linux start script line endig problemLinux start script line endig problembug closed user loki
#2118 Liskov Substitution Principle concernsLiskov Substitution Principle concernsother new user jojusuar
#1911 Listen to Specific AudioListen to Specific Audioquestion opened user Interface
#656 Load SWF from memory: 64 bit problems (Chrome)Load SWF from memory: 64 bit problems (Chrome)question closed user cenadacoisa
#1427 Loading graphicsLoading graphicsbug postponed user CobraGamer
#1219 Loading, Saving, Expoting not workingLoading, Saving, Expoting not workingbug closed user Sergio_D
#425 loadVariables is compiled incorrectlyloadVariables is compiled incorrectlybug closed user svetlana
#1360 Local register postincrement, decrement precedenceLocal register postincrement, decrement precedencebug closed user Daniel
#467 Lock parameters panelLock parameters panelfeature closed user megalol
#1625 Log save in .txtLog save in .txtfeature new user Kuroneko
#2172 Log window thinks that the year is 2024 when the date is set to 31 Dec 2023Log window thinks that the year is 2024 when the date is set to 31 Dec 2023bug closed user ljcool2006
#477 Log window uses Russian localization file evein if I select English language.Log window uses Russian localization file evein if I select English language.bug closed user focus
#508 Logging exception on GUI-less OSeS / SSH sessionsLogging exception on GUI-less OSeS / SSH sessionsbug closed user cattode
#12 logical computing  &  handling temporary variables generated by compiler  & if-elsif-else statement & NEED_ARGUMENTS  logical computing & handling temporary variables generated by compiler & if-elsif-else statement & NEED_ARGUMENTS bug closed user googleCode
#932 Logo Flash onscreen and then nothingLogo Flash onscreen and then nothingquestion closed user kevorkien
#397 Long decompilationLong decompilationbug closed user fusix
#1627 Long search bugLong search bugbug closed user Kuroneko
#841 Loop control for sound previewLoop control for sound previewfeature closed user henke37
#844 lowercase/uppercase convertion in DefineTexts (in right click menu of selected text at Parameters panel)lowercase/uppercase convertion in DefineTexts (in right click menu of selected text at Parameters panel)feature closed user megalol
#622 Mac homebrew package?Mac homebrew package?feature postponed user iggyvolz
#201 Main window never shows on Linux because of call to Advapi32Util.registryKeyExistsMain window never shows on Linux because of call to Advapi32Util.registryKeyExistsbug closed user greghnz
#810 Make a new line in DefineTexts by pressing "Enter" buttonMake a new line in DefineTexts by pressing "Enter" buttonfeature postponed user megalol
#821 make bookmarks for DefineTexts (and maybe for scripts too)make bookmarks for DefineTexts (and maybe for scripts too)feature closed user megalol
#465 Make editable font parameters (bold and italic) in DefineFont*Make editable font parameters (bold and italic) in DefineFont*feature closed user megalol
#1276 Making local variables to toggleMaking local variables to togglequestion closed user capasha
#1198 Making small modifications to script causes game to crashMaking small modifications to script causes game to crashbug closed user tgp1994
#2110 Malware problemMalware problemquestion opened user thrustmaster
#1909 mass export (inc. cmd) images to JPEG format and save the alpha channel to separate file to keep swf size (after importing its back)mass export (inc. cmd) images to JPEG format and save the alpha channel to separate file to keep swf size (after importing its back)feature closed user megalol
#2180 Mass Update Character IDsMass Update Character IDsfeature new user Luxe3710
#288 Memory (RAM) leak (by javaw.exe) after .fla exportingMemory (RAM) leak (by javaw.exe) after .fla exportingbug closed user megalol
#2112 Memory leak when opening gfx fileMemory leak when opening gfx filebug closed user pwtest
#26 Merging DoABCTagsMerging DoABCTagsfeature ignored user googleCode
#157 method decomilation fails when deobfuscation is selectedmethod decomilation fails when deobfuscation is selectedbug closed developer honfika
#2192 Method is decompiled to one enormous line, with overlapping textMethod is decompiled to one enormous line, with overlapping textbug new user Aaron1011
#166 method is partially decompiledmethod is partially decompiledbug closed developer honfika
#243 method is partially decompiledmethod is partially decompiledbug closed developer honfika
#1174 Method/Getter/Setter Trait is in swedish after changing language to englishMethod/Getter/Setter Trait is in swedish after changing language to englishbug closed user capasha
#1063 method_info array content becomes 0x00 after directly editing ac3method_info array content becomes 0x00 after directly editing ac3bug closed user jameswang
#1246 Minimum gui-pane widths (since version 8) make FFDEC unusable on small monitorsMinimum gui-pane widths (since version 8) make FFDEC unusable on small monitorsbug closed user stan
#665 Missed decompiled source when using expression: <expression> && <expression>;Missed decompiled source when using expression: <expression> && <expression>;bug closed user Alexander
#585 Missed decompiled source when using expression: a && b();Missed decompiled source when using expression: a && b();bug closed user Alexander
#1634 Missed focus after edit button in varsMissed focus after edit button in varsbug closed user Kuroneko
#10 Missing "default" code block when decompiling switch .. case sometimesMissing "default" code block when decompiling switch .. case sometimesbug closed user googleCode
#103 Missing blockMissing blockbug closed user pepka
#838 Missing default case in switch statementMissing default case in switch statementbug closed user devbn
#1003 missing fields/methods?missing fields/methods?question closed user BeniBela
#1125 Missing finally block when decompiling try{}finally{} blockMissing finally block when decompiling try{}finally{} blockbug closed user devbn
#140 Missing functionMissing functionbug closed user andy
#128 Missing import for getTimer() functionMissing import for getTimer() functionbug closed user focus
#1135 Missing offset label for try codeMissing offset label for try codebug closed user Suuper
#1158 Missing sprite visualMissing sprite visualfeature closed user Brandon
#1828 MISSING SPRITESMISSING SPRITESbug closed user AndrewAssassins
#2004 Missing Sprites / Crashing once clickedMissing Sprites / Crashing once clickedbug closed user endriu
#1933 Missing variable names in decompiled codeMissing variable names in decompiled codebug closed user pim
#1512 miter limit < 1 error when exporting a spritemiter limit < 1 error when exporting a spritebug closed user hbdfgbfdhgvcbcv
#2185 MochiCrypt decryption throws null pointer exception on specific SWFMochiCrypt decryption throws null pointer exception on specific SWFbug upgraded user nosamu
#1247 Modification on this GFX font [PS3] doesn't seem working as it shouldModification on this GFX font [PS3] doesn't seem working as it shouldbug closed user JoonX86
#2097 Modify the header file in command lineModify the header file in command linefeature closed user wky
#1310 Modulo Order of Operations IncorrectModulo Order of Operations Incorrectbug closed user RobinHood70
#122 More documentation!More documentation!feature closed user focus
#2031 Morphshapes exporting incorrectly when using fla exportMorphshapes exporting incorrectly when using fla exportbug upgraded user ItsJay
#1526 MOUSE SCROLLING IT'S TOO SLOWMOUSE SCROLLING IT'S TOO SLOWbug closed user Timetraveler_1
#1815 Move classes or replace classesMove classes or replace classesfeature new user Colly
#809 Move left, right buttons for DefineTexts using translatex parameterMove left, right buttons for DefineTexts using translatex parameterfeature closed user megalol
#747 Move tag to adds extra frameMove tag to adds extra framebug closed user focus
#1048 Move the classes in package com.jpexs.decompiler.flash.abc.avm2.instructions.other2 to the appropriate packageMove the classes in package com.jpexs.decompiler.flash.abc.avm2.instructions.other2 to the appropriate packagefeature closed developer honfika
#1676 Movie/Video preview not workingMovie/Video preview not workingbug closed user leo_os
#1975 MovieClip to Texture Atlas SupportMovieClip to Texture Atlas Supportfeature new user mete
#1265 MP3SOUNDDATA/MP3FRAME reading problemMP3SOUNDDATA/MP3FRAME reading problembug closed user Scrivener07
#1632 Multi selection searchMulti selection searchfeature new user Kuroneko
#1642 Multiname not found on index [only log of error]Multiname not found on index [only log of error]bug new user Kuroneko
#1192 Multiple default case in switchMultiple default case in switchbug closed developer honfika
#1821 multiple DoAation Tag not applied to frame correctlymultiple DoAation Tag not applied to frame correctlybug opened user aiglove
#1389 Multiple formats not working via command lineMultiple formats not working via command linequestion closed user Lambda
#1629 Multiple selectionsMultiple selectionsfeature postponed user Kuroneko
#1256 Name symbol after ActionScript linkageName symbol after ActionScript linkagefeature new user turkeybaster5723
#1187 named break in switch or try/catchnamed break in switch or try/catchquestion closed user BeniBela
#1692 Namespace "mx_internal" unresolved at line -1 error when trying to compile script after edit, despite not doing any modification while editNamespace "mx_internal" unresolved at line -1 error when trying to compile script after edit, despite not doing any modification while editbug closed user Blitz
#391 Native methodsNative methodsfeature closed user henke37
#2204 Need ignore errors and save anyway featureNeed ignore errors and save anyway featurequestion opened user highFlyer.1
#2122 Negative integers are not supportedNegative integers are not supportedbug upgraded user lsq51201314
#1704 NegativeArraySizeException when loading SWFNegativeArraySizeException when loading SWFbug closed user Kostov
#205 new "quick select" issues: modifiednew "quick select" issues: modifiedfeature closed developer honfika
#1183 New AS2 decompilation problems, it was wokring in version 7.1.1New AS2 decompilation problems, it was wokring in version 7.1.1bug closed developer honfika
#1668 New context menu item (AS3 only)New context menu item (AS3 only)bug closed user STA20
#1106 New Shapes added to SWF files do not have their images added properly when using the replace function.New Shapes added to SWF files do not have their images added properly when using the replace function.feature closed user Necromunger
#354 New TranslationsNew Translationsother opened admin JPEXS
#2093 New version often uses fully qualified names on exportNew version often uses fully qualified names on exportbug closed user ODAKAB
#829 newbie question, SWF preview and wmodenewbie question, SWF preview and wmodequestion closed user tribal
#555 no effect after pressing OK button in new version available dialog in nigthly eed3d652178ano effect after pressing OK button in new version available dialog in nigthly eed3d652178abug closed user megalol
#479 No email notification from nonpublic (but accessible to me) issuesNo email notification from nonpublic (but accessible to me) issuesbug closed developer honfika
#173 No method body update after Globally rename identifierNo method body update after Globally rename identifierbug closed user focus
#1693 No multiname found under cursorNo multiname found under cursorbug new user Krystilize
#1321 No obfuscation, Broken code?No obfuscation, Broken code?bug ignored user Xploit
#783 No OK box when edited script or text was saved (show messages only if it was't saved or with errors)No OK box when edited script or text was saved (show messages only if it was't saved or with errors)feature closed user megalol
#1470 No register or slot setNo register or slot setbug closed user WesleySales3d
#454 No syntax highlight since v1.8.0 in Texts section (Define*)No syntax highlight since v1.8.0 in Texts section (Define*)bug closed user megalol
#1583 Not a typeNot a typebug ignored user nttzx
#1803 Not a type on line X (Not the duplicate of #1065)Not a type on line X (Not the duplicate of #1065)bug closed user cute_doge
#1065 Not a type on line X errorNot a type on line X errorbug closed user angrydweller
#1077 not a valid instance name after export to flanot a valid instance name after export to flabug closed user winxalex
#1169 Not able to save swf file after edited updateNot able to save swf file after edited updatebug closed user dazfaz
#316 not editable panels accept ctrl-z (and ctrl-y)not editable panels accept ctrl-z (and ctrl-y)bug closed developer honfika
#17 Not savingNot savingbug ignored user googleCode
#1162 Not showing all the swf contentsNot showing all the swf contentsbug closed user digdug
#1250 not working  - firewall problemsnot working - firewall problemsquestion closed user Puki
#840 Noticable audio decrease between .wav and .mp3 files exportedNoticable audio decrease between .wav and .mp3 files exportedbug closed user latias1290
#874 Notifiactions about guestbook commentsNotifiactions about guestbook commentsfeature closed developer honfika
#719 null swf name in Proxy after cancelling rename dialognull swf name in Proxy after cancelling rename dialogbug closed user focus
#62 NullPointerExceptionNullPointerExceptionbug closed user wrr
#2066 NullPointerException in ScriptInfo.getPacks when attempting to load api-versioned SWFNullPointerException in ScriptInfo.getPacks when attempting to load api-versioned SWFfeature closed user Aaron1011
#523 Numerous decompilation errors for valid not obfuscated swf while exporting FLANumerous decompilation errors for valid not obfuscated swf while exporting FLAbug closed user focus
#129 obfuscated as2 code, not refreshing decompiled after renameobfuscated as2 code, not refreshing decompiled after renamebug closed user focus
#348 Obfuscated case operatorObfuscated case operatorbug closed user pepka
#441 Obfuscated code, can't decompile swf fileObfuscated code, can't decompile swf filebug closed user hungpq
#1538 Obfuscated names in SWFObfuscated names in SWFquestion closed user VladD
#23 Obfuscated package names don't get renamedObfuscated package names don't get renamedbug closed user googleCode
#1875 Often JPEXS freezes completely (javaw.exe)Often JPEXS freezes completely (javaw.exe)bug closed user Dragodraki
#1517 ok now when i edit i get ah greyed out when starting gameok now when i edit i get ah greyed out when starting gamebug invalid user kinggully123
#1620 Old search styleOld search stylefeature closed user Kuroneko
#1476 On a hi-DPI monitor, any newly created windows will appear behind the main windowOn a hi-DPI monitor, any newly created windows will appear behind the main windowbug closed user DoomTay
#18 On loading of file JPAD v.beta1 never completes loadingOn loading of file JPAD v.beta1 never completes loadingbug ignored user googleCode
#1258 Open dual WindowsOpen dual Windowsquestion closed user Budgie
#86 Open file dialog should accept filenames in quotesOpen file dialog should accept filenames in quotesfeature closed developer honfika
#1918 Open File doesn't load SWFOpen File doesn't load SWFbug closed user capasha
#303 Open folder with exported FLAOpen folder with exported FLAfeature closed user focus
#273 open via proxy problemopen via proxy problemquestion closed user malik
#2117 Open-Close Principle concernsOpen-Close Principle concernsother new user jojusuar
#445 opening a SWF with binary data causes the application to freezeopening a SWF with binary data causes the application to freezebug closed user helmy
#1881 OPENING SPRITE LIST CAUSING ERROROPENING SPRITE LIST CAUSING ERRORbug closed user modder69
#151 option for caching in memory instead of temp filesoption for caching in memory instead of temp filesfeature closed developer honfika
#1717 Option to hide P-code window ?Option to hide P-code window ?feature closed user uzer0
#1802 Option to optimize embedded files (jpg,png,mp3) and recompile/recompress backOption to optimize embedded files (jpg,png,mp3) and recompile/recompress backfeature new user necros2k7
#2189 Option to search in the Replace Sprites panel.Option to search in the Replace Sprites panel.feature new user LordShadow505
#176 Option to show main document class on swf openOption to show main document class on swf openfeature closed user focus
#1716 Options to keep inacessible AS codeOptions to keep inacessible AS codefeature closed user uzer0
#1188 order of static fieldsorder of static fieldsbug closed user BeniBela
#1220 OSX: Open and remember screen size on dual monitorOSX: Open and remember screen size on dual monitorbug closed user hwde
#1341 OutOfMemory error occurred. You are running 32bit Java on 64bit system. Please use 64bit Java.OutOfMemory error occurred. You are running 32bit Java on 64bit system. Please use 64bit Java.bug closed user Labo
#1406 Output to the consoleOutput to the consolequestion new user TCount
#120 P-CodP-Codfeature invalid user focus
#404 P-code and HexP-code and Hexfeature closed user cenadacoisa
#343 P-code coding, I don't know what I does wrong.P-code coding, I don't know what I does wrong.question closed user capasha
#687 P-code comments on separate lineP-code comments on separate linefeature opened user loki
#1083 P-code deobfuscation breaks SWFP-code deobfuscation breaks SWFbug closed user Suuper
#1324 P-code deobfuscation may yield incorrect decompilation(++ operator side effect overlooked)P-code deobfuscation may yield incorrect decompilation(++ operator side effect overlooked)bug closed user vonchun
#270 P-Code deobfuscation progressP-Code deobfuscation progressfeature closed user focus
#1203 P-Code documentsP-Code documentsquestion closed user capasha
#816 P-code not shown after selecting "class initializer" traitP-code not shown after selecting "class initializer" traitbug closed user JackB
#1605 P-code stackP-code stackquestion closed user Kuroneko
#1726 P-code to AS3 issue with continue before breakP-code to AS3 issue with continue before breakbug closed user moecazzell
#2197 Package the app as AppImage for GNU/LinuxPackage the app as AppImage for GNU/Linuxfeature new user Twig6843
#1781 Pad the numbers in generated names, better searchPad the numbers in generated names, better searchfeature new user FareakyTinkerton
#888 Panel width problem in JSyntaxPane with chinese charactersPanel width problem in JSyntaxPane with chinese charactersbug closed developer honfika
#329 paralellSpeedUp switch seems not working & decompilation is much slower in 1.7.0u1 than in 1.7.0paralellSpeedUp switch seems not working & decompilation is much slower in 1.7.0u1 than in 1.7.0bug closed developer honfika
#938 parallel feature keeps setting to low number, not default 20parallel feature keeps setting to low number, not default 20bug closed user BeStPRoGiE
#2061 Param names in as3 interfacesParam names in as3 interfacesquestion opened user Aivaz
#1152 Parameters for texts DefineText (11) disappear and x and y values are not correctly setParameters for texts DefineText (11) disappear and x and y values are not correctly setbug closed user joneleit
#530 Parameters windows cannot display Chinese character after 1.8u1Parameters windows cannot display Chinese character after 1.8u1bug closed user rendu2mai
#1235 Parent Close Comma ErrorParent Close Comma Errorbug closed user rhp1989
#237 Parentheses in AS1/2Parentheses in AS1/2feature closed developer honfika
#1490 PARENT_CLOSE EXPECTED but THIS found - Editing Cast opPARENT_CLOSE EXPECTED but THIS found - Editing Cast opbug closed user Owyn
#32 ParseExceptionParseExceptionbug closed user googleCode
#73 ParseExceptionParseExceptionbug closed user wrr
#543 parseInt() is sometimes assumed. toString() as well.parseInt() is sometimes assumed. toString() as well.bug closed user ether
#1150 Partial decompilation (in try catch?)Partial decompilation (in try catch?)bug closed user Brandon
#2124 Paste and replace sprite with common namePaste and replace sprite with common namefeature upgraded user modder69
#1816 PDF export leaks temporary filesPDF export leaks temporary filesbug closed user dogtocat
#1817 PDF export recompresses embedded images unconditionallyPDF export recompresses embedded images unconditionallybug closed user dogtocat
#1847 pdf frame exported is not same as displayed in browser or ffdexpdf frame exported is not same as displayed in browser or ffdexbug closed user nissanjp
#1912 Persist selected item in tree view while searching with Ctrl-FPersist selected item in tree view while searching with Ctrl-Ffeature closed user nosamu
#1222 Place local classes in separate nodes in the package explorerPlace local classes in separate nodes in the package explorerfeature new user henke37
#1872 PlaceObject orphans (minor bug)PlaceObject orphans (minor bug)bug closed user STA20
#1834 PlaceObject4 tags appear as UnresolvedPlaceObject4 tags appear as Unresolvedbug closed user henke37
#357 Play selected sound (DefineSound tag)Play selected sound (DefineSound tag)feature closed user focus
#1784 playerglobalplayerglobalother closed user canada1122
#1069 playerglobal.swc missingplayerglobal.swc missingquestion closed user BlossomStein
#857 Please add scroll on DefineFont3Please add scroll on DefineFont3feature closed user Jerky
#587 Please add Swf->XML, XML->Swf convertorPlease add Swf->XML, XML->Swf convertorfeature closed user adrianchiq
#1322 Plugins for FFDECPlugins for FFDECfeature closed user capasha
#1369 PNG exporte with bad qualityPNG exporte with bad qualitybug closed user bob456
#1216 PNG files with transparencies are being exported with a background color.PNG files with transparencies are being exported with a background color.bug closed user robcob
#1043 PNG Images come out at lower resolutionPNG Images come out at lower resolutionbug new user SDragon
#973 Pointless §§dupPointless §§dupbug closed user BeniBela
#1670 Popup windows not visiblePopup windows not visiblequestion returned user CPU
#63 Possibility to globaly rename variable identifier after deobfuscationPossibility to globaly rename variable identifier after deobfuscationfeature closed user testic
#1067 Possible bug with AS3 direct editPossible bug with AS3 direct editbug ignored user DV8FromTheWorld
#770 Possible Incorrect Code?Possible Incorrect Code?question closed user calculuswhiz
#1253 Possible to add a addEventListener?Possible to add a addEventListener?question closed user capasha
#426 Possible to rename all identifiers in swf using command line? If no, i too much need this feature ;( Possible to rename all identifiers in swf using command line? If no, i too much need this feature ;( feature closed user devsaider
#1379 postincrement in parameter list confuses JPEXSpostincrement in parameter list confuses JPEXSbug closed user svdb
#2042 Potential bug in ReflectUtils#getClasses(String)Potential bug in ReflectUtils#getClasses(String)other opened user alfu
#2006 Preserving embeds (assets) after decompilationPreserving embeds (assets) after decompilationfeature closed user ReactX
#527 Pretty print error "linkageExportForAS"Pretty print error "linkageExportForAS"bug closed user DrMefistO
#331 previewing fonts (that in import list)previewing fonts (that in import list)feature closed user megalol
#1200 Previous search text should be selected when quick find toolbar opensPrevious search text should be selected when quick find toolbar opensfeature closed developer honfika
#1040 Probably a P-Code reading bugProbably a P-Code reading bugbug closed developer honfika
#109 Probably wrong parameter is passes to getASMSource functionProbably wrong parameter is passes to getASMSource functionbug closed developer honfika
#889 Problem Opening the Application - MacProblem Opening the Application - Macbug closed user UiPE
#1993 Problem previewing shapes/spritesProblem previewing shapes/spritesbug upgraded user STA20
#934 problem when editingproblem when editingbug closed user BYakaS
#1534 Problem with FFDEC XML import for DefineButton/DefineButton2 tagsProblem with FFDEC XML import for DefineButton/DefineButton2 tagsbug closed user FFDEC_USER
#1800 Problem with image exportProblem with image exportbug closed user reverse_master
#1679 Problem with MorphShapesProblem with MorphShapesbug closed user BDslick
#691 Problem with v3 when editing SWF already edited in prevs versionsProblem with v3 when editing SWF already edited in prevs versionsbug closed user marianux
#1489 Problems with negation and for each loops in the AS2 compilerProblems with negation and for each loops in the AS2 compilerbug closed user figStuff
#2021 Problems with tab indentation in code editorProblems with tab indentation in code editorbug closed user nosamu
#846 Procedure to run in net beansProcedure to run in net beansquestion closed user chinmayvb
#1391 Procrammatically accessible CLI interface  or otherwiseProcrammatically accessible CLI interface or otherwisefeature new user muhbytes
#400 program stop workingprogram stop workingbug closed user djtrelos